Changes between Initial Version and Version 1 of Ticket #2071, comment 11


Ignore:
Timestamp:
24 Jan 2021 08:50:54 (4 months ago)
Author:
kalxas
Comment:

Legend:

Unmodified
Added
Removed
Modified
  • Ticket #2071, comment 11

    initial v1  
    22
    33{{{
     4creating /<<PKGBUILDDIR>>/.pybuild/cpython3_3.8_scitools-iris/build/iris/tests/results/usecases/pp_to_cf_conversion/to_netcdf
     5copying lib/iris/tests/results/usecases/pp_to_cf_conversion/to_netcdf/000003000000.03.236.000128.1990.12.01.00.00.b_0.cdl -> /<<PKGBUILDDIR>>/.pybuild/cpython3_3.8_scitools-iris/build/iris/tests/results/usecases/pp_to_cf_conversion/to_netcdf
     6copying lib/iris/tests/results/usecases/pp_to_cf_conversion/to_netcdf/000003000000.03.236.004224.1990.12.01.00.00.b_0.cdl -> /<<PKGBUILDDIR>>/.pybuild/cpython3_3.8_scitools-iris/build/iris/tests/results/usecases/pp_to_cf_conversion/to_netcdf
     7copying lib/iris/tests/results/usecases/pp_to_cf_conversion/to_netcdf/000003000000.03.236.008320.1990.12.01.00.00.b_0.cdl -> /<<PKGBUILDDIR>>/.pybuild/cpython3_3.8_scitools-iris/build/iris/tests/results/usecases/pp_to_cf_conversion/to_netcdf
     8copying lib/iris/tests/results/usecases/pp_to_cf_conversion/to_netcdf/000003000000.16.202.000128.1860.09.01.00.00.b_0.cdl -> /<<PKGBUILDDIR>>/.pybuild/cpython3_3.8_scitools-iris/build/iris/tests/results/usecases/pp_to_cf_conversion/to_netcdf
     9copying lib/iris/tests/results/usecases/pp_to_cf_conversion/to_netcdf/001000000000.00.000.000000.1860.01.01.00.00.f.b_0.cdl -> /<<PKGBUILDDIR>>/.pybuild/cpython3_3.8_scitools-iris/build/iris/tests/results/usecases/pp_to_cf_conversion/to_netcdf
     10copying lib/iris/tests/results/usecases/pp_to_cf_conversion/to_netcdf/002000000000.44.101.131200.1920.09.01.00.00.b_0.cdl -> /<<PKGBUILDDIR>>/.pybuild/cpython3_3.8_scitools-iris/build/iris/tests/results/usecases/pp_to_cf_conversion/to_netcdf
     11copying lib/iris/tests/results/usecases/pp_to_cf_conversion/to_netcdf/008000000000.44.101.000128.1890.09.01.00.00.b_0.cdl -> /<<PKGBUILDDIR>>/.pybuild/cpython3_3.8_scitools-iris/build/iris/tests/results/usecases/pp_to_cf_conversion/to_netcdf
     12copying lib/iris/tests/results/usecases/pp_to_cf_conversion/to_netcdf/12187.b_0.cdl -> /<<PKGBUILDDIR>>/.pybuild/cpython3_3.8_scitools-iris/build/iris/tests/results/usecases/pp_to_cf_conversion/to_netcdf
     13copying lib/iris/tests/results/usecases/pp_to_cf_conversion/to_netcdf/HadCM2_ts_SAT_ann_18602100.b_0.cdl -> /<<PKGBUILDDIR>>/.pybuild/cpython3_3.8_scitools-iris/build/iris/tests/results/usecases/pp_to_cf_conversion/to_netcdf
     14copying lib/iris/tests/results/usecases/pp_to_cf_conversion/to_netcdf/aaxzc_level_lat_orig.b_0.cdl -> /<<PKGBUILDDIR>>/.pybuild/cpython3_3.8_scitools-iris/build/iris/tests/results/usecases/pp_to_cf_conversion/to_netcdf
     15copying lib/iris/tests/results/usecases/pp_to_cf_conversion/to_netcdf/aaxzc_lon_lat_press_orig.b_0.cdl -> /<<PKGBUILDDIR>>/.pybuild/cpython3_3.8_scitools-iris/build/iris/tests/results/usecases/pp_to_cf_conversion/to_netcdf
     16copying lib/iris/tests/results/usecases/pp_to_cf_conversion/to_netcdf/aaxzc_lon_lat_several.b_0.cdl -> /<<PKGBUILDDIR>>/.pybuild/cpython3_3.8_scitools-iris/build/iris/tests/results/usecases/pp_to_cf_conversion/to_netcdf
     17copying lib/iris/tests/results/usecases/pp_to_cf_conversion/to_netcdf/aaxzc_n10r13xy.b_0.cdl -> /<<PKGBUILDDIR>>/.pybuild/cpython3_3.8_scitools-iris/build/iris/tests/results/usecases/pp_to_cf_conversion/to_netcdf
     18copying lib/iris/tests/results/usecases/pp_to_cf_conversion/to_netcdf/aaxzc_time_press.b_0.cdl -> /<<PKGBUILDDIR>>/.pybuild/cpython3_3.8_scitools-iris/build/iris/tests/results/usecases/pp_to_cf_conversion/to_netcdf
     19copying lib/iris/tests/results/usecases/pp_to_cf_conversion/to_netcdf/aaxzc_tseries.b_0.cdl -> /<<PKGBUILDDIR>>/.pybuild/cpython3_3.8_scitools-iris/build/iris/tests/results/usecases/pp_to_cf_conversion/to_netcdf
     20copying lib/iris/tests/results/usecases/pp_to_cf_conversion/to_netcdf/abcza_pa19591997_daily_29.b_0.cdl -> /<<PKGBUILDDIR>>/.pybuild/cpython3_3.8_scitools-iris/build/iris/tests/results/usecases/pp_to_cf_conversion/to_netcdf
     21copying lib/iris/tests/results/usecases/pp_to_cf_conversion/to_netcdf/abcza_pa19591997_daily_29.b_1.cdl -> /<<PKGBUILDDIR>>/.pybuild/cpython3_3.8_scitools-iris/build/iris/tests/results/usecases/pp_to_cf_conversion/to_netcdf
     22copying lib/iris/tests/results/usecases/pp_to_cf_conversion/to_netcdf/abcza_pa19591997_daily_29.b_2.cdl -> /<<PKGBUILDDIR>>/.pybuild/cpython3_3.8_scitools-iris/build/iris/tests/results/usecases/pp_to_cf_conversion/to_netcdf
     23copying lib/iris/tests/results/usecases/pp_to_cf_conversion/to_netcdf/abxpa_press_lat.b_0.cdl -> /<<PKGBUILDDIR>>/.pybuild/cpython3_3.8_scitools-iris/build/iris/tests/results/usecases/pp_to_cf_conversion/to_netcdf
     24copying lib/iris/tests/results/usecases/pp_to_cf_conversion/to_netcdf/integer.b_0.cdl -> /<<PKGBUILDDIR>>/.pybuild/cpython3_3.8_scitools-iris/build/iris/tests/results/usecases/pp_to_cf_conversion/to_netcdf
     25copying lib/iris/tests/results/usecases/pp_to_cf_conversion/to_netcdf/model.b_0.cdl -> /<<PKGBUILDDIR>>/.pybuild/cpython3_3.8_scitools-iris/build/iris/tests/results/usecases/pp_to_cf_conversion/to_netcdf
     26copying lib/iris/tests/results/usecases/pp_to_cf_conversion/to_netcdf/ocean_xsect.b_0.cdl -> /<<PKGBUILDDIR>>/.pybuild/cpython3_3.8_scitools-iris/build/iris/tests/results/usecases/pp_to_cf_conversion/to_netcdf
     27copying lib/iris/tests/results/usecases/pp_to_cf_conversion/to_netcdf/st0fc699.b_0.cdl -> /<<PKGBUILDDIR>>/.pybuild/cpython3_3.8_scitools-iris/build/iris/tests/results/usecases/pp_to_cf_conversion/to_netcdf
     28copying lib/iris/tests/results/usecases/pp_to_cf_conversion/to_netcdf/st0fc942.b_0.cdl -> /<<PKGBUILDDIR>>/.pybuild/cpython3_3.8_scitools-iris/build/iris/tests/results/usecases/pp_to_cf_conversion/to_netcdf
     29copying lib/iris/tests/results/usecases/pp_to_cf_conversion/to_netcdf/st30211.b_0.cdl -> /<<PKGBUILDDIR>>/.pybuild/cpython3_3.8_scitools-iris/build/iris/tests/results/usecases/pp_to_cf_conversion/to_netcdf
     30creating /<<PKGBUILDDIR>>/.pybuild/cpython3_3.8_scitools-iris/build/iris/tests/results/usecases/pp_to_cf_conversion/to_pp
     31copying lib/iris/tests/results/usecases/pp_to_cf_conversion/to_pp/000003000000.03.236.000128.1990.12.01.00.00.b.pp.txt -> /<<PKGBUILDDIR>>/.pybuild/cpython3_3.8_scitools-iris/build/iris/tests/results/usecases/pp_to_cf_conversion/to_pp
     32copying lib/iris/tests/results/usecases/pp_to_cf_conversion/to_pp/000003000000.03.236.004224.1990.12.01.00.00.b.pp.txt -> /<<PKGBUILDDIR>>/.pybuild/cpython3_3.8_scitools-iris/build/iris/tests/results/usecases/pp_to_cf_conversion/to_pp
     33copying lib/iris/tests/results/usecases/pp_to_cf_conversion/to_pp/000003000000.03.236.008320.1990.12.01.00.00.b.pp.txt -> /<<PKGBUILDDIR>>/.pybuild/cpython3_3.8_scitools-iris/build/iris/tests/results/usecases/pp_to_cf_conversion/to_pp
     34copying lib/iris/tests/results/usecases/pp_to_cf_conversion/to_pp/000003000000.16.202.000128.1860.09.01.00.00.b.pp.txt -> /<<PKGBUILDDIR>>/.pybuild/cpython3_3.8_scitools-iris/build/iris/tests/results/usecases/pp_to_cf_conversion/to_pp
     35creating /<<PKGBUILDDIR>>/.pybuild/cpython3_3.8_scitools-iris/build/iris/tests/results/util
     36copying lib/iris/tests/results/util/as_compatible_shape_collapsed.cml -> /<<PKGBUILDDIR>>/.pybuild/cpython3_3.8_scitools-iris/build/iris/tests/results/util
     37copying lib/iris/fileformats/_pyke_rules/fc_rules_cf.krb -> /<<PKGBUILDDIR>>/.pybuild/cpython3_3.8_scitools-iris/build/iris/fileformats/_pyke_rules
     38creating /<<PKGBUILDDIR>>/.pybuild/cpython3_3.8_scitools-iris/build/iris/tests/unit/experimental/representation
     39copying lib/iris/tests/unit/experimental/representation/test_CubeRepresentation.py -> /<<PKGBUILDDIR>>/.pybuild/cpython3_3.8_scitools-iris/build/iris/tests/unit/experimental/representation
     40/usr/bin/python3 tools/generate_std_names.py etc/cf-standard-name-table.xml /<<PKGBUILDDIR>>/.pybuild/cpython3_3.8_scitools-iris/build/iris/std_names.py
     41/usr/bin/python3 -c import os; from pyke.target_pkg import target_pkg; target_pkg.load = lambda *args, **kwargs: None; os.chdir(os.path.join('/<<PKGBUILDDIR>>/.pybuild/cpython3_3.8_scitools-iris/build', 'iris', 'fileformats', '_pyke_rules')); from pyke import knowledge_engine; knowledge_engine.engine('')
     42/<<PKGBUILDDIR>>/.pybuild/cpython3_3.8_scitools-iris/build/iris/config.py:84: UserWarning: Ignoring config item 'Resources':'test_data_dir' (section:option) as '/home/h05/itwl/projects/git/iris-test-data/test_data' is not a valid directory path.
     43  warnings.warn(msg.format(section, option, c_path))
     44/<<PKGBUILDDIR>>/.pybuild/cpython3_3.8_scitools-iris/build/iris/fileformats/netcdf.py:1052: SyntaxWarning: "is" with a literal. Did you mean "=="?
     45  if data_dtype.itemsize is 1:
    446Unable to create '/usr/lib/python3/dist-packages/pyke/krb_compiler/krbparser_tables.py'
    547[Errno 13] Permission denied: '/usr/lib/python3/dist-packages/pyke/krb_compiler/krbparser_tables.py'
     
    2668PermissionError: [Errno 13] Permission denied: '/usr/lib/python3/dist-packages/pyke/krb_compiler/scanner_tables.py'
    2769error: command '/usr/bin/python3' failed with exit status 1
     70E: pybuild pybuild:341: build: plugin distutils failed with: exit code=1: /usr/bin/python3 setup.py build
     71dh_auto_build: error: pybuild --build --test-nose -i python{version} -p 3.8 returned exit code 13
     72make: *** [debian/rules:8: build] Error 25
     73dpkg-buildpackage: error: debian/rules build subprocess returned exit status 2
     74--------------------------------------------------------------------------------
     75Build finished at 2020-12-17T16:02:00Z
     76
    2877}}}