Ticket #1710: build_1.log

File build_1.log, 187.2 KB (added by kalxas, 4 years ago)

Deb build log

Line 
1 -> Copying COW directory
2  forking: rm -rf /var/cache/pbuilder/build//cow.11223
3  forking: cp -al /home/user/cow-xenial /var/cache/pbuilder/build//cow.11223
4I: removed stale ilistfile /var/cache/pbuilder/build//cow.11223/.ilist
5  forking: chroot /var/cache/pbuilder/build//cow.11223 cowdancer-ilistcreate /.ilist find . -xdev -path ./home -prune -o \( \( -type l -o -type f \) -a -links +1 -print0 \) | xargs -0 stat --format '%d %i '
6 -> Invoking pbuilder
7  forking: pbuilder build --buildplace /var/cache/pbuilder/build//cow.11223 --buildresult /var/cache/pbuilder/trusty-i386/result/ --debbuildopts  --no-targz --internal-chrootexec chroot /var/cache/pbuilder/build//cow.11223 cow-shell /home/user/packaging/zoo-project_1.6.0~rev771-0~xenial0.dsc
8I: Running in no-targz mode
9I: using fakeroot in build.
10I: Current time: Sat Jun 11 14:38:19 EEST 2016
11I: pbuilder-time-stamp: 1465645099
12I: copying local configuration
13I: mounting /proc filesystem
14I: mounting /run/shm filesystem
15I: mounting /dev/pts filesystem
16I: policy-rc.d already exists
17I: Obtaining the cached apt archive contents
18I: Installing the build-deps
19 -> Attempting to satisfy build-dependencies
20 -> Creating pbuilder-satisfydepends-dummy package
21Package: pbuilder-satisfydepends-dummy
22Version: 0.invalid.0
23Architecture: i386
24Maintainer: Debian Pbuilder Team <pbuilder-maint@lists.alioth.debian.org>
25Description: Dummy package to satisfy dependencies with aptitude - created by pbuilder
26 This package was created automatically by pbuilder to satisfy the
27 build-dependencies of the package being currently built.
28Depends: debhelper (>= 9), dpkg-dev (>= 1.16.1.1), autoconf, automake, autotools-dev, flex, bison, libssl-dev, libcurl4-gnutls-dev, libgdal-dev, python-dev, python-all, libfcgi-dev, libxml2-dev, libxslt1-dev, libcgal-dev, libmapserver-dev, libmozjs185-dev
29Conflicts: libcurl3-openssl-dev
30dpkg-deb: building package 'pbuilder-satisfydepends-dummy' in '/tmp/satisfydepends-aptitude/pbuilder-satisfydepends-dummy.deb'.
31Selecting previously unselected package pbuilder-satisfydepends-dummy.
32(Reading database ... 12236 files and directories currently installed.)
33Preparing to unpack .../pbuilder-satisfydepends-dummy.deb ...
34Unpacking pbuilder-satisfydepends-dummy (0.invalid.0) ...
35dpkg: pbuilder-satisfydepends-dummy: dependency problems, but configuring anyway as you requested:
36 pbuilder-satisfydepends-dummy depends on debhelper (>= 9); however:
37  Package debhelper is not installed.
38 pbuilder-satisfydepends-dummy depends on autoconf; however:
39  Package autoconf is not installed.
40 pbuilder-satisfydepends-dummy depends on automake; however:
41  Package automake is not installed.
42 pbuilder-satisfydepends-dummy depends on autotools-dev; however:
43  Package autotools-dev is not installed.
44 pbuilder-satisfydepends-dummy depends on flex; however:
45  Package flex is not installed.
46 pbuilder-satisfydepends-dummy depends on bison; however:
47  Package bison is not installed.
48 pbuilder-satisfydepends-dummy depends on libssl-dev; however:
49  Package libssl-dev is not installed.
50 pbuilder-satisfydepends-dummy depends on libcurl4-gnutls-dev; however:
51  Package libcurl4-gnutls-dev is not installed.
52 pbuilder-satisfydepends-dummy depends on libgdal-dev; however:
53  Package libgdal-dev is not installed.
54 pbuilder-s
55Setting up pbuilder-satisfydepends-dummy (0.invalid.0) ...
56Reading package lists...
57Building dependency tree...
58Reading state information...
59Initializing package states...
60Writing extended state information...
61Building tag database...
62pbuilder-satisfydepends-dummy is already installed at the requested version (0.invalid.0)
63pbuilder-satisfydepends-dummy is already installed at the requested version (0.invalid.0)
64The following NEW packages will be installed:
65  autoconf{a} automake{a} autotools-dev{a} bison{a} bsdmainutils{a}
66  comerr-dev{a} debhelper{a} dh-strip-nondeterminism{a} file{a} flex{a}
67  fontconfig{a} fontconfig-config{a} fonts-dejavu-core{a} gettext{a}
68  gettext-base{a} gfortran{a} gfortran-5{a} groff-base{a} hdf5-helpers{a}
69  icu-devtools{a} intltool-debian{a} krb5-multidev{a} libaec-dev{a}
70  libaec0{a} libarchive-zip-perl{a} libarmadillo-dev{a} libarmadillo6{a}
71  libarpack2{a} libarpack2-dev{a} libasn1-8-heimdal{a} libasprintf0v5{a}
72  libbison-dev{a} libblas-common{a} libblas-dev{a} libblas3{a}
73  libboost-atomic1.58-dev{a} libboost-atomic1.58.0{a}
74  libboost-chrono1.58-dev{a} libboost-chrono1.58.0{a}
75  libboost-date-time1.58-dev{a} libboost-date-time1.58.0{a} libboost-dev{a}
76  libboost-program-options-dev{a} libboost-program-options1.58-dev{a}
77  libboost-program-options1.58.0{a} libboost-serialization1.58-dev{a}
78  libboost-serialization1.58.0{a} libboost-system-dev{a}
79  libboost-system1.58-dev{a} libboost-system1.58.0{a}
80  libboost-thread-dev{a} libboost-thread1.58-dev{a}
81  libboost-thread1.58.0{a} libboost1.58-dev{a} libbsd0{a} libcairo2{a}
82  libcgal-dev{a} libcgal11v5{a} libcroco3{a} libcrypto++-dev{a}
83  libcrypto++9v5{a} libcurl3-gnutls{a} libcurl4-gnutls-dev{a} libdap-dev{a}
84  libdap17v5{a} libdapclient6v5{a} libdapserver7v5{a} libdatrie1{a}
85  libdrm-amdgpu1{a} libdrm-intel1{a} libdrm-nouveau2{a} libdrm-radeon1{a}
86  libdrm2{a} libedit2{a} libelf1{a} libepsilon-dev{a} libepsilon1{a}
87  libexpat1{a} libexpat1-dev{a} libfcgi-dev{a} libfcgi0ldbl{a}
88  libffi-dev{a} libffi6{a} libfile-stripnondeterminism-perl{a} libfl-dev{a}
89  libfontconfig1{a} libfreetype6{a} libfreexl-dev{a} libfreexl1{a}
90  libfribidi0{a} libgdal-dev{a} libgdal20{a} libgdk-pixbuf2.0-0{a}
91  libgdk-pixbuf2.0-common{a} libgeos-3.5.0{a} libgeos-c1v5{a}
92  libgeos-dev{a} libgeotiff-dev{a} libgeotiff2{a} libgfortran-5-dev{a}
93  libgfortran3{a} libgif-dev{a} libgif7{a} libgl1-mesa-dri{a}
94  libgl1-mesa-glx{a} libglapi-mesa{a} libglib2.0-0{a} libgmp-dev{a}
95  libgmpxx4ldbl{a} libgnutls30{a} libgraphite2-3{a} libgssapi-krb5-2{a}
96  libgssapi3-heimdal{a} libgssrpc4{a} libharfbuzz0b{a}
97  libhcrypto4-heimdal{a} libhdf4-0-alt{a} libhdf4-alt-dev{a} libhdf5-10{a}
98  libhdf5-cpp-11{a} libhdf5-dev{a} libheimbase1-heimdal{a}
99  libheimntlm0-heimdal{a} libhogweed4{a} libhx509-5-heimdal{a}
100  libicu-dev{a} libicu55{a} libidn11{a} libjbig-dev{a} libjbig0{a}
101  libjpeg-dev{a} libjpeg-turbo8{a} libjpeg-turbo8-dev{a} libjpeg8{a}
102  libjpeg8-dev{a} libjson-c-dev{a} libjson-c2{a} libk5crypto3{a}
103  libkadm5clnt-mit9{a} libkadm5srv-mit9{a} libkdb5-8{a} libkeyutils1{a}
104  libkml-dev{a} libkmlbase1{a} libkmlconvenience1{a} libkmldom1{a}
105  libkmlengine1{a} libkmlregionator1{a} libkmlxsd1{a} libkrb5-26-heimdal{a}
106  libkrb5-3{a} libkrb5support0{a} liblapack-dev{a} liblapack3{a}
107  liblcms2-2{a} libldap-2.4-2{a} libllvm3.8{a} libltdl-dev{a} libltdl7{a}
108  liblzma-dev{a} libmagic1{a} libmapserver-dev{a} libmapserver2{a}
109  libminizip-dev{a} libminizip1{a} libmozjs185-1.0{a} libmozjs185-dev{a}
110  libmpfr-dev{a} libmysqlclient-dev{a} libmysqlclient20{a} libnetcdf-dev{a}
111  libnetcdf11{a} libnettle6{a} libnspr4{a} libnspr4-dev{a} libodbc1{a}
112  libogdi3.2{a} libogdi3.2-dev{a} libopenjp2-7{a} libopenjp2-7-dev{a}
113  libp11-kit0{a} libpango-1.0-0{a} libpangocairo-1.0-0{a}
114  libpangoft2-1.0-0{a} libpciaccess0{a} libpcre16-3{a} libpcre3-dev{a}
115  libpcre32-3{a} libpcrecpp0v5{a} libpipeline1{a} libpixman-1-0{a}
116  libpng12-0{a} libpng12-dev{a} libpoppler-dev{a} libpoppler-private-dev{a}
117  libpoppler58{a} libpq-dev{a} libpq5{a} libproj-dev{a} libproj9{a}
118  libpython-dev{a} libpython-stdlib{a} libpython2.7{a} libpython2.7-dev{a}
119  libpython2.7-minimal{a} libpython2.7-stdlib{a} libqhull-dev{a}
120  libqhull7{a} libroken18-heimdal{a} librsvg2-2{a} librtmp1{a}
121  libsasl2-2{a} libsasl2-modules-db{a} libsigsegv2{a} libspatialite-dev{a}
122  libspatialite7{a} libsqlite3-dev{a} libssl-dev{a} libssl1.0.0{a}
123  libsuperlu-dev{a} libsuperlu4{a} libsz2{a} libtasn1-6{a} libthai-data{a}
124  libthai0{a} libtiff5{a} libtiff5-dev{a} libtiffxx5{a} libtimedate-perl{a}
125  libunistring0{a} liburiparser-dev{a} liburiparser1{a} libwebp-dev{a}
126  libwebp5{a} libwebpdemux1{a} libwebpmux1{a} libwind0-heimdal{a}
127  libx11-6{a} libx11-data{a} libx11-xcb1{a} libxau6{a} libxcb-dri2-0{a}
128  libxcb-dri3-0{a} libxcb-glx0{a} libxcb-present0{a} libxcb-render0{a}
129  libxcb-shm0{a} libxcb-sync1{a} libxcb1{a} libxdamage1{a} libxdmcp6{a}
130  libxerces-c-dev{a} libxerces-c3.1{a} libxext6{a} libxfixes3{a} libxml2{a}
131  libxml2-dev{a} libxrender1{a} libxshmfence1{a} libxslt1-dev{a}
132  libxslt1.1{a} libxxf86vm1{a} m4{a} man-db{a} mime-support{a}
133  mysql-common{a} odbcinst{a} odbcinst1debian2{a} pkg-config{a}
134  po-debconf{a} proj-data{a} python{a} python-all{a} python-dev{a}
135  python-minimal{a} python2.7{a} python2.7-dev{a} python2.7-minimal{a}
136  ucf{a} unixodbc{a} unixodbc-dev{a} uuid-dev{a} zlib1g-dev{a}
137The following packages are RECOMMENDED but will NOT be installed:
138  ca-certificates curl krb5-locales libasprintf-dev libgettextpo-dev
139  libglib2.0-data libmail-sendmail-perl librsvg2-common libsasl2-modules
140  libssl-doc libtool libtxc-dxtn-s2tc0 lynx-cur proj-bin shared-mime-info
141  wget xdg-user-dirs xml-core
1420 packages upgraded, 283 newly installed, 0 to remove and 0 not upgraded.
143Need to get 0 B/160 MB of archives. After unpacking 786 MB will be used.
144Writing extended state information...
145debconf: delaying package configuration, since apt-utils is not installed
146Selecting previously unselected package libjson-c2:i386.
147(Reading database ... (Reading database ... 5% (Reading database ... 10% (Reading database ... 15% (Reading database ... 20% (Reading database ... 25% (Reading database ... 30% (Reading database ... 35% (Reading database ... 40% (Reading database ... 45% (Reading database ... 50% (Reading database ... 55% (Reading database ... 60% (Reading database ... 65% (Reading database ... 70% (Reading database ... 75% (Reading database ... 80% (Reading database ... 85% (Reading database ... 90% (Reading database ... 95% (Reading database ... 100% (Reading database ... 12236 files and directories currently installed.)
148Preparing to unpack .../libjson-c2_0.11-4ubuntu2_i386.deb ...
149Unpacking libjson-c2:i386 (0.11-4ubuntu2) ...
150Selecting previously unselected package libxau6:i386.
151Preparing to unpack .../libxau6_1%3a1.0.8-1_i386.deb ...
152Unpacking libxau6:i386 (1:1.0.8-1) ...
153Selecting previously unselected package libxdmcp6:i386.
154Preparing to unpack .../libxdmcp6_1%3a1.1.2-1.1_i386.deb ...
155Unpacking libxdmcp6:i386 (1:1.1.2-1.1) ...
156Selecting previously unselected package libxcb1:i386.
157Preparing to unpack .../libxcb1_1.11.1-1ubuntu1_i386.deb ...
158Unpacking libxcb1:i386 (1.11.1-1ubuntu1) ...
159Selecting previously unselected package libx11-data.
160Preparing to unpack .../libx11-data_2%3a1.6.3-1ubuntu2_all.deb ...
161Unpacking libx11-data (2:1.6.3-1ubuntu2) ...
162Selecting previously unselected package libx11-6:i386.
163Preparing to unpack .../libx11-6_2%3a1.6.3-1ubuntu2_i386.deb ...
164Unpacking libx11-6:i386 (2:1.6.3-1ubuntu2) ...
165Selecting previously unselected package libxext6:i386.
166Preparing to unpack .../libxext6_2%3a1.3.3-1_i386.deb ...
167Unpacking libxext6:i386 (2:1.3.3-1) ...
168Selecting previously unselected package groff-base.
169Preparing to unpack .../groff-base_1.22.3-7_i386.deb ...
170Unpacking groff-base (1.22.3-7) ...
171Selecting previously unselected package bsdmainutils.
172Preparing to unpack .../bsdmainutils_9.0.6ubuntu3_i386.deb ...
173Unpacking bsdmainutils (9.0.6ubuntu3) ...
174Selecting previously unselected package libpipeline1:i386.
175Preparing to unpack .../libpipeline1_1.4.1-2_i386.deb ...
176Unpacking libpipeline1:i386 (1.4.1-2) ...
177Selecting previously unselected package man-db.
178Preparing to unpack .../man-db_2.7.5-1_i386.deb ...
179Unpacking man-db (2.7.5-1) ...
180Selecting previously unselected package libsigsegv2:i386.
181Preparing to unpack .../libsigsegv2_2.10-4_i386.deb ...
182Unpacking libsigsegv2:i386 (2.10-4) ...
183Selecting previously unselected package m4.
184Preparing to unpack .../archives/m4_1.4.17-5_i386.deb ...
185Unpacking m4 (1.4.17-5) ...
186Selecting previously unselected package libfl-dev:i386.
187Preparing to unpack .../libfl-dev_2.6.0-11_i386.deb ...
188Unpacking libfl-dev:i386 (2.6.0-11) ...
189Selecting previously unselected package flex.
190Preparing to unpack .../flex_2.6.0-11_i386.deb ...
191Unpacking flex (2.6.0-11) ...
192Selecting previously unselected package fonts-dejavu-core.
193Preparing to unpack .../fonts-dejavu-core_2.35-1_all.deb ...
194Unpacking fonts-dejavu-core (2.35-1) ...
195Selecting previously unselected package ucf.
196Preparing to unpack .../archives/ucf_3.0036_all.deb ...
197Moving old data out of the way
198Unpacking ucf (3.0036) ...
199Selecting previously unselected package fontconfig-config.
200Preparing to unpack .../fontconfig-config_2.11.94-0ubuntu1_all.deb ...
201Unpacking fontconfig-config (2.11.94-0ubuntu1) ...
202Selecting previously unselected package libexpat1:i386.
203Preparing to unpack .../libexpat1_2.1.0-7_i386.deb ...
204Unpacking libexpat1:i386 (2.1.0-7) ...
205Selecting previously unselected package libpng12-0:i386.
206Preparing to unpack .../libpng12-0_1.2.54-1ubuntu1_i386.deb ...
207Unpacking libpng12-0:i386 (1.2.54-1ubuntu1) ...
208Selecting previously unselected package libfreetype6:i386.
209Preparing to unpack .../libfreetype6_2.6.1-0.1ubuntu2_i386.deb ...
210Unpacking libfreetype6:i386 (2.6.1-0.1ubuntu2) ...
211Selecting previously unselected package libfontconfig1:i386.
212Preparing to unpack .../libfontconfig1_2.11.94-0ubuntu1_i386.deb ...
213Unpacking libfontconfig1:i386 (2.11.94-0ubuntu1) ...
214Selecting previously unselected package fontconfig.
215Preparing to unpack .../fontconfig_2.11.94-0ubuntu1_i386.deb ...
216Unpacking fontconfig (2.11.94-0ubuntu1) ...
217Selecting previously unselected package libjpeg-turbo8:i386.
218Preparing to unpack .../libjpeg-turbo8_1.4.2-0ubuntu3_i386.deb ...
219Unpacking libjpeg-turbo8:i386 (1.4.2-0ubuntu3) ...
220Selecting previously unselected package liblcms2-2:i386.
221Preparing to unpack .../liblcms2-2_2.6-3ubuntu2_i386.deb ...
222Unpacking liblcms2-2:i386 (2.6-3ubuntu2) ...
223Selecting previously unselected package libpcrecpp0v5:i386.
224Preparing to unpack .../libpcrecpp0v5_2%3a8.38-3.1_i386.deb ...
225Unpacking libpcrecpp0v5:i386 (2:8.38-3.1) ...
226Selecting previously unselected package libblas-common.
227Preparing to unpack .../libblas-common_3.6.0-2ubuntu2_i386.deb ...
228Unpacking libblas-common (3.6.0-2ubuntu2) ...
229Selecting previously unselected package libblas3.
230Preparing to unpack .../libblas3_3.6.0-2ubuntu2_i386.deb ...
231Unpacking libblas3 (3.6.0-2ubuntu2) ...
232Selecting previously unselected package libsuperlu4:i386.
233Preparing to unpack .../libsuperlu4_4.3+dfsg-3_i386.deb ...
234Unpacking libsuperlu4:i386 (4.3+dfsg-3) ...
235Selecting previously unselected package libunistring0:i386.
236Preparing to unpack .../libunistring0_0.9.3-5.2ubuntu1_i386.deb ...
237Unpacking libunistring0:i386 (0.9.3-5.2ubuntu1) ...
238Selecting previously unselected package libxdamage1:i386.
239Preparing to unpack .../libxdamage1_1%3a1.1.4-2_i386.deb ...
240Unpacking libxdamage1:i386 (1:1.1.4-2) ...
241Selecting previously unselected package libxfixes3:i386.
242Preparing to unpack .../libxfixes3_1%3a5.0.1-2_i386.deb ...
243Unpacking libxfixes3:i386 (1:5.0.1-2) ...
244Selecting previously unselected package libxshmfence1:i386.
245Preparing to unpack .../libxshmfence1_1.2-1_i386.deb ...
246Unpacking libxshmfence1:i386 (1.2-1) ...
247Selecting previously unselected package libxxf86vm1:i386.
248Preparing to unpack .../libxxf86vm1_1%3a1.1.4-1_i386.deb ...
249Unpacking libxxf86vm1:i386 (1:1.1.4-1) ...
250Selecting previously unselected package libpython2.7-minimal:i386.
251Preparing to unpack .../libpython2.7-minimal_2.7.11-7ubuntu1_i386.deb ...
252Unpacking libpython2.7-minimal:i386 (2.7.11-7ubuntu1) ...
253Selecting previously unselected package python2.7-minimal.
254Preparing to unpack .../python2.7-minimal_2.7.11-7ubuntu1_i386.deb ...
255Unpacking python2.7-minimal (2.7.11-7ubuntu1) ...
256Selecting previously unselected package python-minimal.
257Preparing to unpack .../python-minimal_2.7.11-1_i386.deb ...
258Unpacking python-minimal (2.7.11-1) ...
259Selecting previously unselected package mime-support.
260Preparing to unpack .../mime-support_3.59ubuntu1_all.deb ...
261Unpacking mime-support (3.59ubuntu1) ...
262Selecting previously unselected package libffi6:i386.
263Preparing to unpack .../libffi6_3.2.1-4_i386.deb ...
264Unpacking libffi6:i386 (3.2.1-4) ...
265Selecting previously unselected package libssl1.0.0:i386.
266Preparing to unpack .../libssl1.0.0_1.0.2g-1ubuntu4_i386.deb ...
267Unpacking libssl1.0.0:i386 (1.0.2g-1ubuntu4) ...
268Selecting previously unselected package libpython2.7-stdlib:i386.
269Preparing to unpack .../libpython2.7-stdlib_2.7.11-7ubuntu1_i386.deb ...
270Unpacking libpython2.7-stdlib:i386 (2.7.11-7ubuntu1) ...
271Selecting previously unselected package python2.7.
272Preparing to unpack .../python2.7_2.7.11-7ubuntu1_i386.deb ...
273Unpacking python2.7 (2.7.11-7ubuntu1) ...
274Selecting previously unselected package libpython-stdlib:i386.
275Preparing to unpack .../libpython-stdlib_2.7.11-1_i386.deb ...
276Unpacking libpython-stdlib:i386 (2.7.11-1) ...
277Processing triggers for libc-bin (2.23-0ubuntu3) ...
278Setting up libpython2.7-minimal:i386 (2.7.11-7ubuntu1) ...
279Setting up python2.7-minimal (2.7.11-7ubuntu1) ...
280Setting up python-minimal (2.7.11-1) ...
281Selecting previously unselected package python.
282(Reading database ... (Reading database ... 5% (Reading database ... 10% (Reading database ... 15% (Reading database ... 20% (Reading database ... 25% (Reading database ... 30% (Reading database ... 35% (Reading database ... 40% (Reading database ... 45% (Reading database ... 50% (Reading database ... 55% (Reading database ... 60% (Reading database ... 65% (Reading database ... 70% (Reading database ... 75% (Reading database ... 80% (Reading database ... 85% (Reading database ... 90% (Reading database ... 95% (Reading database ... 100% (Reading database ... 14234 files and directories currently installed.)
283Preparing to unpack .../python_2.7.11-1_i386.deb ...
284Unpacking python (2.7.11-1) ...
285Selecting previously unselected package libjbig0:i386.
286Preparing to unpack .../libjbig0_2.1-3.1_i386.deb ...
287Unpacking libjbig0:i386 (2.1-3.1) ...
288Selecting previously unselected package libmagic1:i386.
289Preparing to unpack .../libmagic1_1%3a5.25-2ubuntu1_i386.deb ...
290Unpacking libmagic1:i386 (1:5.25-2ubuntu1) ...
291Selecting previously unselected package file.
292Preparing to unpack .../file_1%3a5.25-2ubuntu1_i386.deb ...
293Unpacking file (1:5.25-2ubuntu1) ...
294Selecting previously unselected package libbsd0:i386.
295Preparing to unpack .../libbsd0_0.8.2-1_i386.deb ...
296Unpacking libbsd0:i386 (0.8.2-1) ...
297Selecting previously unselected package libfribidi0:i386.
298Preparing to unpack .../libfribidi0_0.19.7-1_i386.deb ...
299Unpacking libfribidi0:i386 (0.19.7-1) ...
300Selecting previously unselected package libnettle6:i386.
301Preparing to unpack .../libnettle6_3.2-1_i386.deb ...
302Unpacking libnettle6:i386 (3.2-1) ...
303Selecting previously unselected package libhogweed4:i386.
304Preparing to unpack .../libhogweed4_3.2-1_i386.deb ...
305Unpacking libhogweed4:i386 (3.2-1) ...
306Selecting previously unselected package libidn11:i386.
307Preparing to unpack .../libidn11_1.32-3ubuntu1_i386.deb ...
308Unpacking libidn11:i386 (1.32-3ubuntu1) ...
309Selecting previously unselected package libp11-kit0:i386.
310Preparing to unpack .../libp11-kit0_0.23.2-3_i386.deb ...
311Unpacking libp11-kit0:i386 (0.23.2-3) ...
312Selecting previously unselected package libtasn1-6:i386.
313Preparing to unpack .../libtasn1-6_4.7-3_i386.deb ...
314Unpacking libtasn1-6:i386 (4.7-3) ...
315Selecting previously unselected package libgnutls30:i386.
316Preparing to unpack .../libgnutls30_3.4.10-4ubuntu1_i386.deb ...
317Unpacking libgnutls30:i386 (3.4.10-4ubuntu1) ...
318Selecting previously unselected package libasprintf0v5:i386.
319Preparing to unpack .../libasprintf0v5_0.19.7-2ubuntu3_i386.deb ...
320Unpacking libasprintf0v5:i386 (0.19.7-2ubuntu3) ...
321Selecting previously unselected package gettext-base.
322Preparing to unpack .../gettext-base_0.19.7-2ubuntu3_i386.deb ...
323Unpacking gettext-base (0.19.7-2ubuntu3) ...
324Selecting previously unselected package libroken18-heimdal:i386.
325Preparing to unpack .../libroken18-heimdal_1.7~git20150920+dfsg-4ubuntu1_i386.deb ...
326Unpacking libroken18-heimdal:i386 (1.7~git20150920+dfsg-4ubuntu1) ...
327Selecting previously unselected package libasn1-8-heimdal:i386.
328Preparing to unpack .../libasn1-8-heimdal_1.7~git20150920+dfsg-4ubuntu1_i386.deb ...
329Unpacking libasn1-8-heimdal:i386 (1.7~git20150920+dfsg-4ubuntu1) ...
330Selecting previously unselected package libkrb5support0:i386.
331Preparing to unpack .../libkrb5support0_1.13.2+dfsg-5_i386.deb ...
332Unpacking libkrb5support0:i386 (1.13.2+dfsg-5) ...
333Selecting previously unselected package libk5crypto3:i386.
334Preparing to unpack .../libk5crypto3_1.13.2+dfsg-5_i386.deb ...
335Unpacking libk5crypto3:i386 (1.13.2+dfsg-5) ...
336Selecting previously unselected package libkeyutils1:i386.
337Preparing to unpack .../libkeyutils1_1.5.9-8ubuntu1_i386.deb ...
338Unpacking libkeyutils1:i386 (1.5.9-8ubuntu1) ...
339Selecting previously unselected package libkrb5-3:i386.
340Preparing to unpack .../libkrb5-3_1.13.2+dfsg-5_i386.deb ...
341Unpacking libkrb5-3:i386 (1.13.2+dfsg-5) ...
342Selecting previously unselected package libgssapi-krb5-2:i386.
343Preparing to unpack .../libgssapi-krb5-2_1.13.2+dfsg-5_i386.deb ...
344Unpacking libgssapi-krb5-2:i386 (1.13.2+dfsg-5) ...
345Selecting previously unselected package libhcrypto4-heimdal:i386.
346Preparing to unpack .../libhcrypto4-heimdal_1.7~git20150920+dfsg-4ubuntu1_i386.deb ...
347Unpacking libhcrypto4-heimdal:i386 (1.7~git20150920+dfsg-4ubuntu1) ...
348Selecting previously unselected package libheimbase1-heimdal:i386.
349Preparing to unpack .../libheimbase1-heimdal_1.7~git20150920+dfsg-4ubuntu1_i386.deb ...
350Unpacking libheimbase1-heimdal:i386 (1.7~git20150920+dfsg-4ubuntu1) ...
351Selecting previously unselected package libwind0-heimdal:i386.
352Preparing to unpack .../libwind0-heimdal_1.7~git20150920+dfsg-4ubuntu1_i386.deb ...
353Unpacking libwind0-heimdal:i386 (1.7~git20150920+dfsg-4ubuntu1) ...
354Selecting previously unselected package libhx509-5-heimdal:i386.
355Preparing to unpack .../libhx509-5-heimdal_1.7~git20150920+dfsg-4ubuntu1_i386.deb ...
356Unpacking libhx509-5-heimdal:i386 (1.7~git20150920+dfsg-4ubuntu1) ...
357Selecting previously unselected package libkrb5-26-heimdal:i386.
358Preparing to unpack .../libkrb5-26-heimdal_1.7~git20150920+dfsg-4ubuntu1_i386.deb ...
359Unpacking libkrb5-26-heimdal:i386 (1.7~git20150920+dfsg-4ubuntu1) ...
360Selecting previously unselected package libheimntlm0-heimdal:i386.
361Preparing to unpack .../libheimntlm0-heimdal_1.7~git20150920+dfsg-4ubuntu1_i386.deb ...
362Unpacking libheimntlm0-heimdal:i386 (1.7~git20150920+dfsg-4ubuntu1) ...
363Selecting previously unselected package libgssapi3-heimdal:i386.
364Preparing to unpack .../libgssapi3-heimdal_1.7~git20150920+dfsg-4ubuntu1_i386.deb ...
365Unpacking libgssapi3-heimdal:i386 (1.7~git20150920+dfsg-4ubuntu1) ...
366Selecting previously unselected package libsasl2-modules-db:i386.
367Preparing to unpack .../libsasl2-modules-db_2.1.26.dfsg1-14build1_i386.deb ...
368Unpacking libsasl2-modules-db:i386 (2.1.26.dfsg1-14build1) ...
369Selecting previously unselected package libsasl2-2:i386.
370Preparing to unpack .../libsasl2-2_2.1.26.dfsg1-14build1_i386.deb ...
371Unpacking libsasl2-2:i386 (2.1.26.dfsg1-14build1) ...
372Selecting previously unselected package libldap-2.4-2:i386.
373Preparing to unpack .../libldap-2.4-2_2.4.42+dfsg-2ubuntu3_i386.deb ...
374Unpacking libldap-2.4-2:i386 (2.4.42+dfsg-2ubuntu3) ...
375Selecting previously unselected package librtmp1:i386.
376Preparing to unpack .../librtmp1_2.4+20151223.gitfa8646d-1build1_i386.deb ...
377Unpacking librtmp1:i386 (2.4+20151223.gitfa8646d-1build1) ...
378Selecting previously unselected package libcurl3-gnutls:i386.
379Preparing to unpack .../libcurl3-gnutls_7.47.0-1ubuntu2_i386.deb ...
380Unpacking libcurl3-gnutls:i386 (7.47.0-1ubuntu2) ...
381Selecting previously unselected package libdrm2:i386.
382Preparing to unpack .../libdrm2_2.4.67-1_i386.deb ...
383Unpacking libdrm2:i386 (2.4.67-1) ...
384Selecting previously unselected package libedit2:i386.
385Preparing to unpack .../libedit2_3.1-20150325-1ubuntu2_i386.deb ...
386Unpacking libedit2:i386 (3.1-20150325-1ubuntu2) ...
387Selecting previously unselected package libelf1:i386.
388Preparing to unpack .../libelf1_0.165-3ubuntu1_i386.deb ...
389Unpacking libelf1:i386 (0.165-3ubuntu1) ...
390Selecting previously unselected package libglib2.0-0:i386.
391Preparing to unpack .../libglib2.0-0_2.48.0-1ubuntu4_i386.deb ...
392Unpacking libglib2.0-0:i386 (2.48.0-1ubuntu4) ...
393Selecting previously unselected package libicu55:i386.
394Preparing to unpack .../libicu55_55.1-7_i386.deb ...
395Unpacking libicu55:i386 (55.1-7) ...
396Selecting previously unselected package libxml2:i386.
397Preparing to unpack .../libxml2_2.9.3+dfsg1-1_i386.deb ...
398Unpacking libxml2:i386 (2.9.3+dfsg1-1) ...
399Selecting previously unselected package autoconf.
400Preparing to unpack .../autoconf_2.69-9_all.deb ...
401Unpacking autoconf (2.69-9) ...
402Selecting previously unselected package autotools-dev.
403Preparing to unpack .../autotools-dev_20150820.1_all.deb ...
404Unpacking autotools-dev (20150820.1) ...
405Selecting previously unselected package automake.
406Preparing to unpack .../automake_1%3a1.15-4ubuntu1_all.deb ...
407Unpacking automake (1:1.15-4ubuntu1) ...
408Selecting previously unselected package libbison-dev:i386.
409Preparing to unpack .../libbison-dev_2%3a3.0.4.dfsg-1_i386.deb ...
410Unpacking libbison-dev:i386 (2:3.0.4.dfsg-1) ...
411Selecting previously unselected package bison.
412Preparing to unpack .../bison_2%3a3.0.4.dfsg-1_i386.deb ...
413Unpacking bison (2:3.0.4.dfsg-1) ...
414Selecting previously unselected package libcroco3:i386.
415Preparing to unpack .../libcroco3_0.6.11-1_i386.deb ...
416Unpacking libcroco3:i386 (0.6.11-1) ...
417Selecting previously unselected package gettext.
418Preparing to unpack .../gettext_0.19.7-2ubuntu3_i386.deb ...
419Unpacking gettext (0.19.7-2ubuntu3) ...
420Selecting previously unselected package intltool-debian.
421Preparing to unpack .../intltool-debian_0.35.0+20060710.4_all.deb ...
422Unpacking intltool-debian (0.35.0+20060710.4) ...
423Selecting previously unselected package po-debconf.
424Preparing to unpack .../po-debconf_1.0.19_all.deb ...
425Unpacking po-debconf (1.0.19) ...
426Selecting previously unselected package libarchive-zip-perl.
427Preparing to unpack .../libarchive-zip-perl_1.56-2_all.deb ...
428Unpacking libarchive-zip-perl (1.56-2) ...
429Selecting previously unselected package libfile-stripnondeterminism-perl.
430Preparing to unpack .../libfile-stripnondeterminism-perl_0.015-1_all.deb ...
431Unpacking libfile-stripnondeterminism-perl (0.015-1) ...
432Selecting previously unselected package libtimedate-perl.
433Preparing to unpack .../libtimedate-perl_2.3000-2_all.deb ...
434Unpacking libtimedate-perl (2.3000-2) ...
435Selecting previously unselected package dh-strip-nondeterminism.
436Preparing to unpack .../dh-strip-nondeterminism_0.015-1_all.deb ...
437Unpacking dh-strip-nondeterminism (0.015-1) ...
438Selecting previously unselected package debhelper.
439Preparing to unpack .../debhelper_9.20160115ubuntu3_all.deb ...
440Unpacking debhelper (9.20160115ubuntu3) ...
441Selecting previously unselected package libgfortran3:i386.
442Preparing to unpack .../libgfortran3_5.3.1-14ubuntu2_i386.deb ...
443Unpacking libgfortran3:i386 (5.3.1-14ubuntu2) ...
444Selecting previously unselected package libgfortran-5-dev:i386.
445Preparing to unpack .../libgfortran-5-dev_5.3.1-14ubuntu2_i386.deb ...
446Unpacking libgfortran-5-dev:i386 (5.3.1-14ubuntu2) ...
447Selecting previously unselected package gfortran-5.
448Preparing to unpack .../gfortran-5_5.3.1-14ubuntu2_i386.deb ...
449Unpacking gfortran-5 (5.3.1-14ubuntu2) ...
450Selecting previously unselected package gfortran.
451Preparing to unpack .../gfortran_4%3a5.3.1-1ubuntu1_i386.deb ...
452Unpacking gfortran (4:5.3.1-1ubuntu1) ...
453Selecting previously unselected package hdf5-helpers.
454Preparing to unpack .../hdf5-helpers_1.8.16+docs-4ubuntu1_i386.deb ...
455Unpacking hdf5-helpers (1.8.16+docs-4ubuntu1) ...
456Selecting previously unselected package icu-devtools.
457Preparing to unpack .../icu-devtools_55.1-7_i386.deb ...
458Unpacking icu-devtools (55.1-7) ...
459Selecting previously unselected package libgssrpc4:i386.
460Preparing to unpack .../libgssrpc4_1.13.2+dfsg-5_i386.deb ...
461Unpacking libgssrpc4:i386 (1.13.2+dfsg-5) ...
462Selecting previously unselected package libkdb5-8:i386.
463Preparing to unpack .../libkdb5-8_1.13.2+dfsg-5_i386.deb ...
464Unpacking libkdb5-8:i386 (1.13.2+dfsg-5) ...
465Selecting previously unselected package libkadm5srv-mit9:i386.
466Preparing to unpack .../libkadm5srv-mit9_1.13.2+dfsg-5_i386.deb ...
467Unpacking libkadm5srv-mit9:i386 (1.13.2+dfsg-5) ...
468Selecting previously unselected package libkadm5clnt-mit9:i386.
469Preparing to unpack .../libkadm5clnt-mit9_1.13.2+dfsg-5_i386.deb ...
470Unpacking libkadm5clnt-mit9:i386 (1.13.2+dfsg-5) ...
471Selecting previously unselected package comerr-dev.
472Preparing to unpack .../comerr-dev_2.1-1.42.13-1ubuntu1_i386.deb ...
473Unpacking comerr-dev (2.1-1.42.13-1ubuntu1) ...
474Selecting previously unselected package krb5-multidev.
475Preparing to unpack .../krb5-multidev_1.13.2+dfsg-5_i386.deb ...
476Unpacking krb5-multidev (1.13.2+dfsg-5) ...
477Selecting previously unselected package libaec0:i386.
478Preparing to unpack .../libaec0_0.3.2-1_i386.deb ...
479Unpacking libaec0:i386 (0.3.2-1) ...
480Selecting previously unselected package liblapack3.
481Preparing to unpack .../liblapack3_3.6.0-2ubuntu2_i386.deb ...
482Unpacking liblapack3 (3.6.0-2ubuntu2) ...
483Selecting previously unselected package libarpack2.
484Preparing to unpack .../libarpack2_3.3.0-1build2_i386.deb ...
485Unpacking libarpack2 (3.3.0-1build2) ...
486Selecting previously unselected package libarmadillo6.
487Preparing to unpack .../libarmadillo6_1%3a6.500.5+dfsg-1_i386.deb ...
488Unpacking libarmadillo6 (1:6.500.5+dfsg-1) ...
489Selecting previously unselected package libblas-dev.
490Preparing to unpack .../libblas-dev_3.6.0-2ubuntu2_i386.deb ...
491Unpacking libblas-dev (3.6.0-2ubuntu2) ...
492Selecting previously unselected package liblapack-dev.
493Preparing to unpack .../liblapack-dev_3.6.0-2ubuntu2_i386.deb ...
494Unpacking liblapack-dev (3.6.0-2ubuntu2) ...
495Selecting previously unselected package libarpack2-dev.
496Preparing to unpack .../libarpack2-dev_3.3.0-1build2_i386.deb ...
497Unpacking libarpack2-dev (3.3.0-1build2) ...
498Selecting previously unselected package libsz2:i386.
499Preparing to unpack .../libsz2_0.3.2-1_i386.deb ...
500Unpacking libsz2:i386 (0.3.2-1) ...
501Selecting previously unselected package libhdf5-10:i386.
502Preparing to unpack .../libhdf5-10_1.8.16+docs-4ubuntu1_i386.deb ...
503Unpacking libhdf5-10:i386 (1.8.16+docs-4ubuntu1) ...
504Selecting previously unselected package zlib1g-dev:i386.
505Preparing to unpack .../zlib1g-dev_1%3a1.2.8.dfsg-2ubuntu4_i386.deb ...
506Unpacking zlib1g-dev:i386 (1:1.2.8.dfsg-2ubuntu4) ...
507Selecting previously unselected package libjpeg-turbo8-dev:i386.
508Preparing to unpack .../libjpeg-turbo8-dev_1.4.2-0ubuntu3_i386.deb ...
509Unpacking libjpeg-turbo8-dev:i386 (1.4.2-0ubuntu3) ...
510Selecting previously unselected package libjpeg8:i386.
511Preparing to unpack .../libjpeg8_8c-2ubuntu8_i386.deb ...
512Unpacking libjpeg8:i386 (8c-2ubuntu8) ...
513Selecting previously unselected package libjpeg8-dev:i386.
514Preparing to unpack .../libjpeg8-dev_8c-2ubuntu8_i386.deb ...
515Unpacking libjpeg8-dev:i386 (8c-2ubuntu8) ...
516Selecting previously unselected package libjpeg-dev:i386.
517Preparing to unpack .../libjpeg-dev_8c-2ubuntu8_i386.deb ...
518Unpacking libjpeg-dev:i386 (8c-2ubuntu8) ...
519Selecting previously unselected package libaec-dev:i386.
520Preparing to unpack .../libaec-dev_0.3.2-1_i386.deb ...
521Unpacking libaec-dev:i386 (0.3.2-1) ...
522Selecting previously unselected package libhdf5-cpp-11:i386.
523Preparing to unpack .../libhdf5-cpp-11_1.8.16+docs-4ubuntu1_i386.deb ...
524Unpacking libhdf5-cpp-11:i386 (1.8.16+docs-4ubuntu1) ...
525Selecting previously unselected package libhdf5-dev.
526Preparing to unpack .../libhdf5-dev_1.8.16+docs-4ubuntu1_i386.deb ...
527Unpacking libhdf5-dev (1.8.16+docs-4ubuntu1) ...
528Selecting previously unselected package libsuperlu-dev:i386.
529Preparing to unpack .../libsuperlu-dev_4.3+dfsg-3_i386.deb ...
530Unpacking libsuperlu-dev:i386 (4.3+dfsg-3) ...
531Selecting previously unselected package libarmadillo-dev.
532Preparing to unpack .../libarmadillo-dev_1%3a6.500.5+dfsg-1_i386.deb ...
533Unpacking libarmadillo-dev (1:6.500.5+dfsg-1) ...
534Selecting previously unselected package libboost1.58-dev:i386.
535Preparing to unpack .../libboost1.58-dev_1.58.0+dfsg-5ubuntu3_i386.deb ...
536Unpacking libboost1.58-dev:i386 (1.58.0+dfsg-5ubuntu3) ...
537Selecting previously unselected package libboost-atomic1.58.0:i386.
538Preparing to unpack .../libboost-atomic1.58.0_1.58.0+dfsg-5ubuntu3_i386.deb ...
539Unpacking libboost-atomic1.58.0:i386 (1.58.0+dfsg-5ubuntu3) ...
540Selecting previously unselected package libboost-atomic1.58-dev:i386.
541Preparing to unpack .../libboost-atomic1.58-dev_1.58.0+dfsg-5ubuntu3_i386.deb ...
542Unpacking libboost-atomic1.58-dev:i386 (1.58.0+dfsg-5ubuntu3) ...
543Selecting previously unselected package libboost-system1.58.0:i386.
544Preparing to unpack .../libboost-system1.58.0_1.58.0+dfsg-5ubuntu3_i386.deb ...
545Unpacking libboost-system1.58.0:i386 (1.58.0+dfsg-5ubuntu3) ...
546Selecting previously unselected package libboost-chrono1.58.0:i386.
547Preparing to unpack .../libboost-chrono1.58.0_1.58.0+dfsg-5ubuntu3_i386.deb ...
548Unpacking libboost-chrono1.58.0:i386 (1.58.0+dfsg-5ubuntu3) ...
549Selecting previously unselected package libboost-chrono1.58-dev:i386.
550Preparing to unpack .../libboost-chrono1.58-dev_1.58.0+dfsg-5ubuntu3_i386.deb ...
551Unpacking libboost-chrono1.58-dev:i386 (1.58.0+dfsg-5ubuntu3) ...
552Selecting previously unselected package libboost-date-time1.58.0:i386.
553Preparing to unpack .../libboost-date-time1.58.0_1.58.0+dfsg-5ubuntu3_i386.deb ...
554Unpacking libboost-date-time1.58.0:i386 (1.58.0+dfsg-5ubuntu3) ...
555Selecting previously unselected package libboost-serialization1.58.0:i386.
556Preparing to unpack .../libboost-serialization1.58.0_1.58.0+dfsg-5ubuntu3_i386.deb ...
557Unpacking libboost-serialization1.58.0:i386 (1.58.0+dfsg-5ubuntu3) ...
558Selecting previously unselected package libboost-serialization1.58-dev:i386.
559Preparing to unpack .../libboost-serialization1.58-dev_1.58.0+dfsg-5ubuntu3_i386.deb ...
560Unpacking libboost-serialization1.58-dev:i386 (1.58.0+dfsg-5ubuntu3) ...
561Selecting previously unselected package libboost-date-time1.58-dev:i386.
562Preparing to unpack .../libboost-date-time1.58-dev_1.58.0+dfsg-5ubuntu3_i386.deb ...
563Unpacking libboost-date-time1.58-dev:i386 (1.58.0+dfsg-5ubuntu3) ...
564Selecting previously unselected package libboost-dev:i386.
565Preparing to unpack .../libboost-dev_1.58.0.1ubuntu1_i386.deb ...
566Unpacking libboost-dev:i386 (1.58.0.1ubuntu1) ...
567Selecting previously unselected package libboost-program-options1.58.0:i386.
568Preparing to unpack .../libboost-program-options1.58.0_1.58.0+dfsg-5ubuntu3_i386.deb ...
569Unpacking libboost-program-options1.58.0:i386 (1.58.0+dfsg-5ubuntu3) ...
570Selecting previously unselected package libboost-program-options1.58-dev:i386.
571Preparing to unpack .../libboost-program-options1.58-dev_1.58.0+dfsg-5ubuntu3_i386.deb ...
572Unpacking libboost-program-options1.58-dev:i386 (1.58.0+dfsg-5ubuntu3) ...
573Selecting previously unselected package libboost-program-options-dev:i386.
574Preparing to unpack .../libboost-program-options-dev_1.58.0.1ubuntu1_i386.deb ...
575Unpacking libboost-program-options-dev:i386 (1.58.0.1ubuntu1) ...
576Selecting previously unselected package libboost-system1.58-dev:i386.
577Preparing to unpack .../libboost-system1.58-dev_1.58.0+dfsg-5ubuntu3_i386.deb ...
578Unpacking libboost-system1.58-dev:i386 (1.58.0+dfsg-5ubuntu3) ...
579Selecting previously unselected package libboost-system-dev:i386.
580Preparing to unpack .../libboost-system-dev_1.58.0.1ubuntu1_i386.deb ...
581Unpacking libboost-system-dev:i386 (1.58.0.1ubuntu1) ...
582Selecting previously unselected package libboost-thread1.58.0:i386.
583Preparing to unpack .../libboost-thread1.58.0_1.58.0+dfsg-5ubuntu3_i386.deb ...
584Unpacking libboost-thread1.58.0:i386 (1.58.0+dfsg-5ubuntu3) ...
585Selecting previously unselected package libboost-thread1.58-dev:i386.
586Preparing to unpack .../libboost-thread1.58-dev_1.58.0+dfsg-5ubuntu3_i386.deb ...
587Unpacking libboost-thread1.58-dev:i386 (1.58.0+dfsg-5ubuntu3) ...
588Selecting previously unselected package libboost-thread-dev:i386.
589Preparing to unpack .../libboost-thread-dev_1.58.0.1ubuntu1_i386.deb ...
590Unpacking libboost-thread-dev:i386 (1.58.0.1ubuntu1) ...
591Selecting previously unselected package libpixman-1-0:i386.
592Preparing to unpack .../libpixman-1-0_0.33.6-1_i386.deb ...
593Unpacking libpixman-1-0:i386 (0.33.6-1) ...
594Selecting previously unselected package libxcb-render0:i386.
595Preparing to unpack .../libxcb-render0_1.11.1-1ubuntu1_i386.deb ...
596Unpacking libxcb-render0:i386 (1.11.1-1ubuntu1) ...
597Selecting previously unselected package libxcb-shm0:i386.
598Preparing to unpack .../libxcb-shm0_1.11.1-1ubuntu1_i386.deb ...
599Unpacking libxcb-shm0:i386 (1.11.1-1ubuntu1) ...
600Selecting previously unselected package libxrender1:i386.
601Preparing to unpack .../libxrender1_1%3a0.9.9-0ubuntu1_i386.deb ...
602Unpacking libxrender1:i386 (1:0.9.9-0ubuntu1) ...
603Selecting previously unselected package libcairo2:i386.
604Preparing to unpack .../libcairo2_1.14.6-1_i386.deb ...
605Unpacking libcairo2:i386 (1.14.6-1) ...
606Selecting previously unselected package libglapi-mesa:i386.
607Preparing to unpack .../libglapi-mesa_11.2.0-1ubuntu2_i386.deb ...
608Unpacking libglapi-mesa:i386 (11.2.0-1ubuntu2) ...
609Selecting previously unselected package libx11-xcb1:i386.
610Preparing to unpack .../libx11-xcb1_2%3a1.6.3-1ubuntu2_i386.deb ...
611Unpacking libx11-xcb1:i386 (2:1.6.3-1ubuntu2) ...
612Selecting previously unselected package libxcb-dri2-0:i386.
613Preparing to unpack .../libxcb-dri2-0_1.11.1-1ubuntu1_i386.deb ...
614Unpacking libxcb-dri2-0:i386 (1.11.1-1ubuntu1) ...
615Selecting previously unselected package libxcb-dri3-0:i386.
616Preparing to unpack .../libxcb-dri3-0_1.11.1-1ubuntu1_i386.deb ...
617Unpacking libxcb-dri3-0:i386 (1.11.1-1ubuntu1) ...
618Selecting previously unselected package libxcb-glx0:i386.
619Preparing to unpack .../libxcb-glx0_1.11.1-1ubuntu1_i386.deb ...
620Unpacking libxcb-glx0:i386 (1.11.1-1ubuntu1) ...
621Selecting previously unselected package libxcb-present0:i386.
622Preparing to unpack .../libxcb-present0_1.11.1-1ubuntu1_i386.deb ...
623Unpacking libxcb-present0:i386 (1.11.1-1ubuntu1) ...
624Selecting previously unselected package libxcb-sync1:i386.
625Preparing to unpack .../libxcb-sync1_1.11.1-1ubuntu1_i386.deb ...
626Unpacking libxcb-sync1:i386 (1.11.1-1ubuntu1) ...
627Selecting previously unselected package libdrm-amdgpu1:i386.
628Preparing to unpack .../libdrm-amdgpu1_2.4.67-1_i386.deb ...
629Unpacking libdrm-amdgpu1:i386 (2.4.67-1) ...
630Selecting previously unselected package libpciaccess0:i386.
631Preparing to unpack .../libpciaccess0_0.13.4-1_i386.deb ...
632Unpacking libpciaccess0:i386 (0.13.4-1) ...
633Selecting previously unselected package libdrm-intel1:i386.
634Preparing to unpack .../libdrm-intel1_2.4.67-1_i386.deb ...
635Unpacking libdrm-intel1:i386 (2.4.67-1) ...
636Selecting previously unselected package libdrm-nouveau2:i386.
637Preparing to unpack .../libdrm-nouveau2_2.4.67-1_i386.deb ...
638Unpacking libdrm-nouveau2:i386 (2.4.67-1) ...
639Selecting previously unselected package libdrm-radeon1:i386.
640Preparing to unpack .../libdrm-radeon1_2.4.67-1_i386.deb ...
641Unpacking libdrm-radeon1:i386 (2.4.67-1) ...
642Selecting previously unselected package libllvm3.8:i386.
643Preparing to unpack .../libllvm3.8_1%3a3.8-2ubuntu1_i386.deb ...
644Unpacking libllvm3.8:i386 (1:3.8-2ubuntu1) ...
645Selecting previously unselected package libgl1-mesa-dri:i386.
646Preparing to unpack .../libgl1-mesa-dri_11.2.0-1ubuntu2_i386.deb ...
647Unpacking libgl1-mesa-dri:i386 (11.2.0-1ubuntu2) ...
648Selecting previously unselected package libgl1-mesa-glx:i386.
649Preparing to unpack .../libgl1-mesa-glx_11.2.0-1ubuntu2_i386.deb ...
650Unpacking libgl1-mesa-glx:i386 (11.2.0-1ubuntu2) ...
651Selecting previously unselected package libcgal11v5:i386.
652Preparing to unpack .../libcgal11v5_4.7-4_i386.deb ...
653Unpacking libcgal11v5:i386 (4.7-4) ...
654Selecting previously unselected package libgmpxx4ldbl:i386.
655Preparing to unpack .../libgmpxx4ldbl_2%3a6.1.0+dfsg-2_i386.deb ...
656Unpacking libgmpxx4ldbl:i386 (2:6.1.0+dfsg-2) ...
657Selecting previously unselected package libgmp-dev:i386.
658Preparing to unpack .../libgmp-dev_2%3a6.1.0+dfsg-2_i386.deb ...
659Unpacking libgmp-dev:i386 (2:6.1.0+dfsg-2) ...
660Selecting previously unselected package libmpfr-dev:i386.
661Preparing to unpack .../libmpfr-dev_3.1.4-1_i386.deb ...
662Unpacking libmpfr-dev:i386 (3.1.4-1) ...
663Selecting previously unselected package libcgal-dev:i386.
664Preparing to unpack .../libcgal-dev_4.7-4_i386.deb ...
665Unpacking libcgal-dev:i386 (4.7-4) ...
666Selecting previously unselected package libcrypto++9v5.
667Preparing to unpack .../libcrypto++9v5_5.6.1-9_i386.deb ...
668Unpacking libcrypto++9v5 (5.6.1-9) ...
669Selecting previously unselected package libcrypto++-dev.
670Preparing to unpack .../libcrypto++-dev_5.6.1-9_i386.deb ...
671Unpacking libcrypto++-dev (5.6.1-9) ...
672Selecting previously unselected package libcurl4-gnutls-dev:i386.
673Preparing to unpack .../libcurl4-gnutls-dev_7.47.0-1ubuntu2_i386.deb ...
674Unpacking libcurl4-gnutls-dev:i386 (7.47.0-1ubuntu2) ...
675Selecting previously unselected package libdap17v5:i386.
676Preparing to unpack .../libdap17v5_3.15.1-7_i386.deb ...
677Unpacking libdap17v5:i386 (3.15.1-7) ...
678Selecting previously unselected package libdapserver7v5:i386.
679Preparing to unpack .../libdapserver7v5_3.15.1-7_i386.deb ...
680Unpacking libdapserver7v5:i386 (3.15.1-7) ...
681Selecting previously unselected package libdapclient6v5:i386.
682Preparing to unpack .../libdapclient6v5_3.15.1-7_i386.deb ...
683Unpacking libdapclient6v5:i386 (3.15.1-7) ...
684Selecting previously unselected package libicu-dev:i386.
685Preparing to unpack .../libicu-dev_55.1-7_i386.deb ...
686Unpacking libicu-dev:i386 (55.1-7) ...
687Selecting previously unselected package libxml2-dev:i386.
688Preparing to unpack .../libxml2-dev_2.9.3+dfsg1-1_i386.deb ...
689Unpacking libxml2-dev:i386 (2.9.3+dfsg1-1) ...
690Selecting previously unselected package uuid-dev:i386.
691Preparing to unpack .../uuid-dev_2.27.1-6ubuntu3_i386.deb ...
692Unpacking uuid-dev:i386 (2.27.1-6ubuntu3) ...
693Selecting previously unselected package pkg-config.
694Preparing to unpack .../pkg-config_0.29.1-0ubuntu1_i386.deb ...
695Unpacking pkg-config (0.29.1-0ubuntu1) ...
696Selecting previously unselected package libdap-dev:i386.
697Preparing to unpack .../libdap-dev_3.15.1-7_i386.deb ...
698Unpacking libdap-dev:i386 (3.15.1-7) ...
699Selecting previously unselected package libdatrie1:i386.
700Preparing to unpack .../libdatrie1_0.2.10-2_i386.deb ...
701Unpacking libdatrie1:i386 (0.2.10-2) ...
702Selecting previously unselected package libepsilon1:i386.
703Preparing to unpack .../libepsilon1_0.9.2-3ubuntu1_i386.deb ...
704Unpacking libepsilon1:i386 (0.9.2-3ubuntu1) ...
705Selecting previously unselected package libexpat1-dev:i386.
706Preparing to unpack .../libexpat1-dev_2.1.0-7_i386.deb ...
707Unpacking libexpat1-dev:i386 (2.1.0-7) ...
708Selecting previously unselected package libfcgi0ldbl.
709Preparing to unpack .../libfcgi0ldbl_2.4.0-8.3_i386.deb ...
710Unpacking libfcgi0ldbl (2.4.0-8.3) ...
711Selecting previously unselected package libfcgi-dev.
712Preparing to unpack .../libfcgi-dev_2.4.0-8.3_i386.deb ...
713Unpacking libfcgi-dev (2.4.0-8.3) ...
714Selecting previously unselected package libfreexl1:i386.
715Preparing to unpack .../libfreexl1_1.0.2-1_i386.deb ...
716Unpacking libfreexl1:i386 (1.0.2-1) ...
717Selecting previously unselected package libgeos-3.5.0.
718Preparing to unpack .../libgeos-3.5.0_3.5.0-1ubuntu2_i386.deb ...
719Unpacking libgeos-3.5.0 (3.5.0-1ubuntu2) ...
720Selecting previously unselected package libgeos-c1v5.
721Preparing to unpack .../libgeos-c1v5_3.5.0-1ubuntu2_i386.deb ...
722Unpacking libgeos-c1v5 (3.5.0-1ubuntu2) ...
723Selecting previously unselected package proj-data.
724Preparing to unpack .../proj-data_4.9.2-2_all.deb ...
725Unpacking proj-data (4.9.2-2) ...
726Selecting previously unselected package libproj9.
727Preparing to unpack .../libproj9_4.9.2-2_i386.deb ...
728Unpacking libproj9 (4.9.2-2) ...
729Selecting previously unselected package libtiff5:i386.
730Preparing to unpack .../libtiff5_4.0.6-1_i386.deb ...
731Unpacking libtiff5:i386 (4.0.6-1) ...
732Selecting previously unselected package libgeotiff2:i386.
733Preparing to unpack .../libgeotiff2_1.4.1-2_i386.deb ...
734Unpacking libgeotiff2:i386 (1.4.1-2) ...
735Selecting previously unselected package libgif7:i386.
736Preparing to unpack .../libgif7_5.1.2-0.2_i386.deb ...
737Unpacking libgif7:i386 (5.1.2-0.2) ...
738Selecting previously unselected package libhdf4-0-alt.
739Preparing to unpack .../libhdf4-0-alt_4.2.10-3.2_i386.deb ...
740Unpacking libhdf4-0-alt (4.2.10-3.2) ...
741Selecting previously unselected package libminizip1:i386.
742Preparing to unpack .../libminizip1_1.1-8_i386.deb ...
743Unpacking libminizip1:i386 (1.1-8) ...
744Selecting previously unselected package liburiparser1:i386.
745Preparing to unpack .../liburiparser1_0.8.4-1_i386.deb ...
746Unpacking liburiparser1:i386 (0.8.4-1) ...
747Selecting previously unselected package libkmlbase1:i386.
748Preparing to unpack .../libkmlbase1_1.3.0-1_i386.deb ...
749Unpacking libkmlbase1:i386 (1.3.0-1) ...
750Selecting previously unselected package libkmldom1:i386.
751Preparing to unpack .../libkmldom1_1.3.0-1_i386.deb ...
752Unpacking libkmldom1:i386 (1.3.0-1) ...
753Selecting previously unselected package libkmlengine1:i386.
754Preparing to unpack .../libkmlengine1_1.3.0-1_i386.deb ...
755Unpacking libkmlengine1:i386 (1.3.0-1) ...
756Selecting previously unselected package mysql-common.
757Preparing to unpack .../mysql-common_5.7.11-0ubuntu6_all.deb ...
758Unpacking mysql-common (5.7.11-0ubuntu6) ...
759Selecting previously unselected package libmysqlclient20:i386.
760Preparing to unpack .../libmysqlclient20_5.7.11-0ubuntu6_i386.deb ...
761Unpacking libmysqlclient20:i386 (5.7.11-0ubuntu6) ...
762Selecting previously unselected package libnetcdf11.
763Preparing to unpack .../libnetcdf11_1%3a4.4.0-2_i386.deb ...
764Unpacking libnetcdf11 (1:4.4.0-2) ...
765Selecting previously unselected package libltdl7:i386.
766Preparing to unpack .../libltdl7_2.4.6-0.1_i386.deb ...
767Unpacking libltdl7:i386 (2.4.6-0.1) ...
768Selecting previously unselected package libodbc1:i386.
769Preparing to unpack .../libodbc1_2.3.1-4.1_i386.deb ...
770Unpacking libodbc1:i386 (2.3.1-4.1) ...
771Selecting previously unselected package libogdi3.2.
772Preparing to unpack .../libogdi3.2_3.2.0~beta2-7.1build1_i386.deb ...
773Unpacking libogdi3.2 (3.2.0~beta2-7.1build1) ...
774Selecting previously unselected package libopenjp2-7:i386.
775Preparing to unpack .../libopenjp2-7_2.1.0-2.1_i386.deb ...
776Unpacking libopenjp2-7:i386 (2.1.0-2.1) ...
777Selecting previously unselected package libpoppler58:i386.
778Preparing to unpack .../libpoppler58_0.41.0-0ubuntu1_i386.deb ...
779Unpacking libpoppler58:i386 (0.41.0-0ubuntu1) ...
780Selecting previously unselected package libpq5:i386.
781Preparing to unpack .../libpq5_9.5.2-1_i386.deb ...
782Unpacking libpq5:i386 (9.5.2-1) ...
783Selecting previously unselected package libqhull7:i386.
784Preparing to unpack .../libqhull7_2015.2-1_i386.deb ...
785Unpacking libqhull7:i386 (2015.2-1) ...
786Selecting previously unselected package libspatialite7:i386.
787Preparing to unpack .../libspatialite7_4.3.0a-5_i386.deb ...
788Unpacking libspatialite7:i386 (4.3.0a-5) ...
789Selecting previously unselected package libwebp5:i386.
790Preparing to unpack .../libwebp5_0.4.4-1_i386.deb ...
791Unpacking libwebp5:i386 (0.4.4-1) ...
792Selecting previously unselected package libxerces-c3.1:i386.
793Preparing to unpack .../libxerces-c3.1_3.1.3+debian-1_i386.deb ...
794Unpacking libxerces-c3.1:i386 (3.1.3+debian-1) ...
795Selecting previously unselected package odbcinst.
796Preparing to unpack .../odbcinst_2.3.1-4.1_i386.deb ...
797Unpacking odbcinst (2.3.1-4.1) ...
798Selecting previously unselected package odbcinst1debian2:i386.
799Preparing to unpack .../odbcinst1debian2_2.3.1-4.1_i386.deb ...
800Unpacking odbcinst1debian2:i386 (2.3.1-4.1) ...
801Selecting previously unselected package libgdal20.
802Preparing to unpack .../libgdal20_2.1.0+dfsg-1~xenial0_i386.deb ...
803Unpacking libgdal20 (2.1.0+dfsg-1~xenial0) ...
804Selecting previously unselected package libepsilon-dev:i386.
805Preparing to unpack .../libepsilon-dev_0.9.2-3ubuntu1_i386.deb ...
806Unpacking libepsilon-dev:i386 (0.9.2-3ubuntu1) ...
807Selecting previously unselected package libfreexl-dev:i386.
808Preparing to unpack .../libfreexl-dev_1.0.2-1_i386.deb ...
809Unpacking libfreexl-dev:i386 (1.0.2-1) ...
810Selecting previously unselected package libgeos-dev.
811Preparing to unpack .../libgeos-dev_3.5.0-1ubuntu2_i386.deb ...
812Unpacking libgeos-dev (3.5.0-1ubuntu2) ...
813Selecting previously unselected package libjbig-dev:i386.
814Preparing to unpack .../libjbig-dev_2.1-3.1_i386.deb ...
815Unpacking libjbig-dev:i386 (2.1-3.1) ...
816Selecting previously unselected package liblzma-dev:i386.
817Preparing to unpack .../liblzma-dev_5.1.1alpha+20120614-2ubuntu2_i386.deb ...
818Unpacking liblzma-dev:i386 (5.1.1alpha+20120614-2ubuntu2) ...
819Selecting previously unselected package libtiffxx5:i386.
820Preparing to unpack .../libtiffxx5_4.0.6-1_i386.deb ...
821Unpacking libtiffxx5:i386 (4.0.6-1) ...
822Selecting previously unselected package libtiff5-dev:i386.
823Preparing to unpack .../libtiff5-dev_4.0.6-1_i386.deb ...
824Unpacking libtiff5-dev:i386 (4.0.6-1) ...
825Selecting previously unselected package libgeotiff-dev:i386.
826Preparing to unpack .../libgeotiff-dev_1.4.1-2_i386.deb ...
827Unpacking libgeotiff-dev:i386 (1.4.1-2) ...
828Selecting previously unselected package libgif-dev.
829Preparing to unpack .../libgif-dev_5.1.2-0.2_i386.deb ...
830Unpacking libgif-dev (5.1.2-0.2) ...
831Selecting previously unselected package libnetcdf-dev.
832Preparing to unpack .../libnetcdf-dev_1%3a4.4.0-2_i386.deb ...
833Unpacking libnetcdf-dev (1:4.4.0-2) ...
834Selecting previously unselected package libhdf4-alt-dev.
835Preparing to unpack .../libhdf4-alt-dev_4.2.10-3.2_i386.deb ...
836Unpacking libhdf4-alt-dev (4.2.10-3.2) ...
837Selecting previously unselected package libjson-c-dev:i386.
838Preparing to unpack .../libjson-c-dev_0.11-4ubuntu2_i386.deb ...
839Unpacking libjson-c-dev:i386 (0.11-4ubuntu2) ...
840Selecting previously unselected package libkmlconvenience1:i386.
841Preparing to unpack .../libkmlconvenience1_1.3.0-1_i386.deb ...
842Unpacking libkmlconvenience1:i386 (1.3.0-1) ...
843Selecting previously unselected package libkmlregionator1:i386.
844Preparing to unpack .../libkmlregionator1_1.3.0-1_i386.deb ...
845Unpacking libkmlregionator1:i386 (1.3.0-1) ...
846Selecting previously unselected package libkmlxsd1:i386.
847Preparing to unpack .../libkmlxsd1_1.3.0-1_i386.deb ...
848Unpacking libkmlxsd1:i386 (1.3.0-1) ...
849Selecting previously unselected package libminizip-dev:i386.
850Preparing to unpack .../libminizip-dev_1.1-8_i386.deb ...
851Unpacking libminizip-dev:i386 (1.1-8) ...
852Selecting previously unselected package liburiparser-dev.
853Preparing to unpack .../liburiparser-dev_0.8.4-1_i386.deb ...
854Unpacking liburiparser-dev (0.8.4-1) ...
855Selecting previously unselected package libkml-dev:i386.
856Preparing to unpack .../libkml-dev_1.3.0-1_i386.deb ...
857Unpacking libkml-dev:i386 (1.3.0-1) ...
858Selecting previously unselected package libltdl-dev:i386.
859Preparing to unpack .../libltdl-dev_2.4.6-0.1_i386.deb ...
860Unpacking libltdl-dev:i386 (2.4.6-0.1) ...
861Selecting previously unselected package libmysqlclient-dev.
862Preparing to unpack .../libmysqlclient-dev_5.7.11-0ubuntu6_i386.deb ...
863Unpacking libmysqlclient-dev (5.7.11-0ubuntu6) ...
864Selecting previously unselected package libproj-dev.
865Preparing to unpack .../libproj-dev_4.9.2-2_i386.deb ...
866Unpacking libproj-dev (4.9.2-2) ...
867Selecting previously unselected package libogdi3.2-dev.
868Preparing to unpack .../libogdi3.2-dev_3.2.0~beta2-7.1build1_i386.deb ...
869Unpacking libogdi3.2-dev (3.2.0~beta2-7.1build1) ...
870Selecting previously unselected package libopenjp2-7-dev.
871Preparing to unpack .../libopenjp2-7-dev_2.1.0-2.1_i386.deb ...
872Unpacking libopenjp2-7-dev (2.1.0-2.1) ...
873Selecting previously unselected package libpcre16-3:i386.
874Preparing to unpack .../libpcre16-3_2%3a8.38-3.1_i386.deb ...
875Unpacking libpcre16-3:i386 (2:8.38-3.1) ...
876Selecting previously unselected package libpcre32-3:i386.
877Preparing to unpack .../libpcre32-3_2%3a8.38-3.1_i386.deb ...
878Unpacking libpcre32-3:i386 (2:8.38-3.1) ...
879Selecting previously unselected package libpcre3-dev:i386.
880Preparing to unpack .../libpcre3-dev_2%3a8.38-3.1_i386.deb ...
881Unpacking libpcre3-dev:i386 (2:8.38-3.1) ...
882Selecting previously unselected package libpng12-dev:i386.
883Preparing to unpack .../libpng12-dev_1.2.54-1ubuntu1_i386.deb ...
884Unpacking libpng12-dev:i386 (1.2.54-1ubuntu1) ...
885Selecting previously unselected package libpoppler-dev:i386.
886Preparing to unpack .../libpoppler-dev_0.41.0-0ubuntu1_i386.deb ...
887Unpacking libpoppler-dev:i386 (0.41.0-0ubuntu1) ...
888Selecting previously unselected package libpoppler-private-dev:i386.
889Preparing to unpack .../libpoppler-private-dev_0.41.0-0ubuntu1_i386.deb ...
890Unpacking libpoppler-private-dev:i386 (0.41.0-0ubuntu1) ...
891Selecting previously unselected package libssl-dev:i386.
892Preparing to unpack .../libssl-dev_1.0.2g-1ubuntu4_i386.deb ...
893Unpacking libssl-dev:i386 (1.0.2g-1ubuntu4) ...
894Selecting previously unselected package libpq-dev.
895Preparing to unpack .../libpq-dev_9.5.2-1_i386.deb ...
896Unpacking libpq-dev (9.5.2-1) ...
897Selecting previously unselected package libqhull-dev:i386.
898Preparing to unpack .../libqhull-dev_2015.2-1_i386.deb ...
899Unpacking libqhull-dev:i386 (2015.2-1) ...
900Selecting previously unselected package libsqlite3-dev:i386.
901Preparing to unpack .../libsqlite3-dev_3.11.0-1ubuntu1_i386.deb ...
902Unpacking libsqlite3-dev:i386 (3.11.0-1ubuntu1) ...
903Selecting previously unselected package libspatialite-dev:i386.
904Preparing to unpack .../libspatialite-dev_4.3.0a-5_i386.deb ...
905Unpacking libspatialite-dev:i386 (4.3.0a-5) ...
906Selecting previously unselected package libwebpmux1:i386.
907Preparing to unpack .../libwebpmux1_0.4.4-1_i386.deb ...
908Unpacking libwebpmux1:i386 (0.4.4-1) ...
909Selecting previously unselected package libwebpdemux1:i386.
910Preparing to unpack .../libwebpdemux1_0.4.4-1_i386.deb ...
911Unpacking libwebpdemux1:i386 (0.4.4-1) ...
912Selecting previously unselected package libwebp-dev:i386.
913Preparing to unpack .../libwebp-dev_0.4.4-1_i386.deb ...
914Unpacking libwebp-dev:i386 (0.4.4-1) ...
915Selecting previously unselected package libxerces-c-dev.
916Preparing to unpack .../libxerces-c-dev_3.1.3+debian-1_i386.deb ...
917Unpacking libxerces-c-dev (3.1.3+debian-1) ...
918Selecting previously unselected package unixodbc.
919Preparing to unpack .../unixodbc_2.3.1-4.1_i386.deb ...
920Unpacking unixodbc (2.3.1-4.1) ...
921Selecting previously unselected package unixodbc-dev.
922Preparing to unpack .../unixodbc-dev_2.3.1-4.1_i386.deb ...
923Unpacking unixodbc-dev (2.3.1-4.1) ...
924Selecting previously unselected package libgdal-dev.
925Preparing to unpack .../libgdal-dev_2.1.0+dfsg-1~xenial0_i386.deb ...
926Unpacking libgdal-dev (2.1.0+dfsg-1~xenial0) ...
927Selecting previously unselected package libgdk-pixbuf2.0-common.
928Preparing to unpack .../libgdk-pixbuf2.0-common_2.32.2-1ubuntu1_all.deb ...
929Unpacking libgdk-pixbuf2.0-common (2.32.2-1ubuntu1) ...
930Selecting previously unselected package libgdk-pixbuf2.0-0:i386.
931Preparing to unpack .../libgdk-pixbuf2.0-0_2.32.2-1ubuntu1_i386.deb ...
932Unpacking libgdk-pixbuf2.0-0:i386 (2.32.2-1ubuntu1) ...
933Selecting previously unselected package libgraphite2-3:i386.
934Preparing to unpack .../libgraphite2-3_1.3.6-1ubuntu1_i386.deb ...
935Unpacking libgraphite2-3:i386 (1.3.6-1ubuntu1) ...
936Selecting previously unselected package libharfbuzz0b:i386.
937Preparing to unpack .../libharfbuzz0b_1.0.1-1build2_i386.deb ...
938Unpacking libharfbuzz0b:i386 (1.0.1-1build2) ...
939Selecting previously unselected package libthai-data.
940Preparing to unpack .../libthai-data_0.1.24-2_all.deb ...
941Unpacking libthai-data (0.1.24-2) ...
942Selecting previously unselected package libthai0:i386.
943Preparing to unpack .../libthai0_0.1.24-2_i386.deb ...
944Unpacking libthai0:i386 (0.1.24-2) ...
945Selecting previously unselected package libpango-1.0-0:i386.
946Preparing to unpack .../libpango-1.0-0_1.38.1-1_i386.deb ...
947Unpacking libpango-1.0-0:i386 (1.38.1-1) ...
948Selecting previously unselected package libpangoft2-1.0-0:i386.
949Preparing to unpack .../libpangoft2-1.0-0_1.38.1-1_i386.deb ...
950Unpacking libpangoft2-1.0-0:i386 (1.38.1-1) ...
951Selecting previously unselected package libpangocairo-1.0-0:i386.
952Preparing to unpack .../libpangocairo-1.0-0_1.38.1-1_i386.deb ...
953Unpacking libpangocairo-1.0-0:i386 (1.38.1-1) ...
954Selecting previously unselected package librsvg2-2:i386.
955Preparing to unpack .../librsvg2-2_2.40.13-3_i386.deb ...
956Unpacking librsvg2-2:i386 (2.40.13-3) ...
957Selecting previously unselected package libmapserver2.
958Preparing to unpack .../libmapserver2_7.0.1-4~xenial1~php5.6_i386.deb ...
959Unpacking libmapserver2 (7.0.1-4~xenial1~php5.6) ...
960Selecting previously unselected package libmapserver-dev.
961Preparing to unpack .../libmapserver-dev_7.0.1-4~xenial1~php5.6_i386.deb ...
962Unpacking libmapserver-dev (7.0.1-4~xenial1~php5.6) ...
963Selecting previously unselected package libnspr4:i386.
964Preparing to unpack .../libnspr4_2%3a4.11-1ubuntu1_i386.deb ...
965Unpacking libnspr4:i386 (2:4.11-1ubuntu1) ...
966Selecting previously unselected package libnspr4-dev.
967Preparing to unpack .../libnspr4-dev_2%3a4.11-1ubuntu1_i386.deb ...
968Unpacking libnspr4-dev (2:4.11-1ubuntu1) ...
969Selecting previously unselected package libpython2.7:i386.
970Preparing to unpack .../libpython2.7_2.7.11-7ubuntu1_i386.deb ...
971Unpacking libpython2.7:i386 (2.7.11-7ubuntu1) ...
972Selecting previously unselected package libpython2.7-dev:i386.
973Preparing to unpack .../libpython2.7-dev_2.7.11-7ubuntu1_i386.deb ...
974Unpacking libpython2.7-dev:i386 (2.7.11-7ubuntu1) ...
975Selecting previously unselected package libpython-dev:i386.
976Preparing to unpack .../libpython-dev_2.7.11-1_i386.deb ...
977Unpacking libpython-dev:i386 (2.7.11-1) ...
978Selecting previously unselected package libxslt1.1:i386.
979Preparing to unpack .../libxslt1.1_1.1.28-2.1_i386.deb ...
980Unpacking libxslt1.1:i386 (1.1.28-2.1) ...
981Selecting previously unselected package libxslt1-dev:i386.
982Preparing to unpack .../libxslt1-dev_1.1.28-2.1_i386.deb ...
983Unpacking libxslt1-dev:i386 (1.1.28-2.1) ...
984Selecting previously unselected package python-all.
985Preparing to unpack .../python-all_2.7.11-1_i386.deb ...
986Unpacking python-all (2.7.11-1) ...
987Selecting previously unselected package python2.7-dev.
988Preparing to unpack .../python2.7-dev_2.7.11-7ubuntu1_i386.deb ...
989Unpacking python2.7-dev (2.7.11-7ubuntu1) ...
990Selecting previously unselected package python-dev.
991Preparing to unpack .../python-dev_2.7.11-1_i386.deb ...
992Unpacking python-dev (2.7.11-1) ...
993Selecting previously unselected package libffi-dev:i386.
994Preparing to unpack .../libffi-dev_3.2.1-4_i386.deb ...
995Unpacking libffi-dev:i386 (3.2.1-4) ...
996Selecting previously unselected package libmozjs185-1.0.
997Preparing to unpack .../libmozjs185-1.0_1.8.5-1.0.0+dfsg-4.5_i386.deb ...
998Unpacking libmozjs185-1.0 (1.8.5-1.0.0+dfsg-4.5) ...
999Selecting previously unselected package libmozjs185-dev.
1000Preparing to unpack .../libmozjs185-dev_1.8.5-1.0.0+dfsg-4.5_i386.deb ...
1001Unpacking libmozjs185-dev (1.8.5-1.0.0+dfsg-4.5) ...
1002Processing triggers for libc-bin (2.23-0ubuntu3) ...
1003Setting up libjson-c2:i386 (0.11-4ubuntu2) ...
1004Setting up libxau6:i386 (1:1.0.8-1) ...
1005Setting up libxdmcp6:i386 (1:1.1.2-1.1) ...
1006Setting up libxcb1:i386 (1.11.1-1ubuntu1) ...
1007Setting up libx11-data (2:1.6.3-1ubuntu2) ...
1008Setting up libx11-6:i386 (2:1.6.3-1ubuntu2) ...
1009Setting up libxext6:i386 (2:1.3.3-1) ...
1010Setting up groff-base (1.22.3-7) ...
1011Setting up bsdmainutils (9.0.6ubuntu3) ...
1012update-alternatives: using /usr/bin/bsd-write to provide /usr/bin/write (write) in auto mode
1013update-alternatives: using /usr/bin/bsd-from to provide /usr/bin/from (from) in auto mode
1014Setting up libpipeline1:i386 (1.4.1-2) ...
1015Setting up man-db (2.7.5-1) ...
1016Building database of manual pages ...
1017Setting up libsigsegv2:i386 (2.10-4) ...
1018Setting up m4 (1.4.17-5) ...
1019Setting up libfl-dev:i386 (2.6.0-11) ...
1020Setting up flex (2.6.0-11) ...
1021Setting up fonts-dejavu-core (2.35-1) ...
1022Setting up ucf (3.0036) ...
1023Setting up fontconfig-config (2.11.94-0ubuntu1) ...
1024Setting up libexpat1:i386 (2.1.0-7) ...
1025Setting up libpng12-0:i386 (1.2.54-1ubuntu1) ...
1026Setting up libfreetype6:i386 (2.6.1-0.1ubuntu2) ...
1027Setting up libfontconfig1:i386 (2.11.94-0ubuntu1) ...
1028Setting up fontconfig (2.11.94-0ubuntu1) ...
1029Regenerating fonts cache... done.
1030Setting up libjpeg-turbo8:i386 (1.4.2-0ubuntu3) ...
1031Setting up liblcms2-2:i386 (2.6-3ubuntu2) ...
1032Setting up libpcrecpp0v5:i386 (2:8.38-3.1) ...
1033Setting up libblas-common (3.6.0-2ubuntu2) ...
1034Setting up libblas3 (3.6.0-2ubuntu2) ...
1035update-alternatives: using /usr/lib/libblas/libblas.so.3 to provide /usr/lib/libblas.so.3 (libblas.so.3) in auto mode
1036Setting up libsuperlu4:i386 (4.3+dfsg-3) ...
1037Setting up libunistring0:i386 (0.9.3-5.2ubuntu1) ...
1038Setting up libxdamage1:i386 (1:1.1.4-2) ...
1039Setting up libxfixes3:i386 (1:5.0.1-2) ...
1040Setting up libxshmfence1:i386 (1.2-1) ...
1041Setting up libxxf86vm1:i386 (1:1.1.4-1) ...
1042Setting up mime-support (3.59ubuntu1) ...
1043Setting up libffi6:i386 (3.2.1-4) ...
1044Setting up libssl1.0.0:i386 (1.0.2g-1ubuntu4) ...
1045Setting up libpython2.7-stdlib:i386 (2.7.11-7ubuntu1) ...
1046Setting up python2.7 (2.7.11-7ubuntu1) ...
1047Setting up libpython-stdlib:i386 (2.7.11-1) ...
1048Setting up python (2.7.11-1) ...
1049Setting up libjbig0:i386 (2.1-3.1) ...
1050Setting up libmagic1:i386 (1:5.25-2ubuntu1) ...
1051Setting up file (1:5.25-2ubuntu1) ...
1052Setting up libbsd0:i386 (0.8.2-1) ...
1053Setting up libfribidi0:i386 (0.19.7-1) ...
1054Setting up libnettle6:i386 (3.2-1) ...
1055Setting up libhogweed4:i386 (3.2-1) ...
1056Setting up libidn11:i386 (1.32-3ubuntu1) ...
1057Setting up libp11-kit0:i386 (0.23.2-3) ...
1058Setting up libtasn1-6:i386 (4.7-3) ...
1059Setting up libgnutls30:i386 (3.4.10-4ubuntu1) ...
1060Setting up libasprintf0v5:i386 (0.19.7-2ubuntu3) ...
1061Setting up gettext-base (0.19.7-2ubuntu3) ...
1062Setting up libroken18-heimdal:i386 (1.7~git20150920+dfsg-4ubuntu1) ...
1063Setting up libasn1-8-heimdal:i386 (1.7~git20150920+dfsg-4ubuntu1) ...
1064Setting up libkrb5support0:i386 (1.13.2+dfsg-5) ...
1065Setting up libk5crypto3:i386 (1.13.2+dfsg-5) ...
1066Setting up libkeyutils1:i386 (1.5.9-8ubuntu1) ...
1067Setting up libkrb5-3:i386 (1.13.2+dfsg-5) ...
1068Setting up libgssapi-krb5-2:i386 (1.13.2+dfsg-5) ...
1069Setting up libhcrypto4-heimdal:i386 (1.7~git20150920+dfsg-4ubuntu1) ...
1070Setting up libheimbase1-heimdal:i386 (1.7~git20150920+dfsg-4ubuntu1) ...
1071Setting up libwind0-heimdal:i386 (1.7~git20150920+dfsg-4ubuntu1) ...
1072Setting up libhx509-5-heimdal:i386 (1.7~git20150920+dfsg-4ubuntu1) ...
1073Setting up libkrb5-26-heimdal:i386 (1.7~git20150920+dfsg-4ubuntu1) ...
1074Setting up libheimntlm0-heimdal:i386 (1.7~git20150920+dfsg-4ubuntu1) ...
1075Setting up libgssapi3-heimdal:i386 (1.7~git20150920+dfsg-4ubuntu1) ...
1076Setting up libsasl2-modules-db:i386 (2.1.26.dfsg1-14build1) ...
1077Setting up libsasl2-2:i386 (2.1.26.dfsg1-14build1) ...
1078Setting up libldap-2.4-2:i386 (2.4.42+dfsg-2ubuntu3) ...
1079Setting up librtmp1:i386 (2.4+20151223.gitfa8646d-1build1) ...
1080Setting up libcurl3-gnutls:i386 (7.47.0-1ubuntu2) ...
1081Setting up libdrm2:i386 (2.4.67-1) ...
1082Setting up libedit2:i386 (3.1-20150325-1ubuntu2) ...
1083Setting up libelf1:i386 (0.165-3ubuntu1) ...
1084Setting up libglib2.0-0:i386 (2.48.0-1ubuntu4) ...
1085No schema files found: doing nothing.
1086Setting up libicu55:i386 (55.1-7) ...
1087Setting up libxml2:i386 (2.9.3+dfsg1-1) ...
1088Setting up autoconf (2.69-9) ...
1089Setting up autotools-dev (20150820.1) ...
1090Setting up automake (1:1.15-4ubuntu1) ...
1091update-alternatives: using /usr/bin/automake-1.15 to provide /usr/bin/automake (automake) in auto mode
1092Setting up libbison-dev:i386 (2:3.0.4.dfsg-1) ...
1093Setting up bison (2:3.0.4.dfsg-1) ...
1094update-alternatives: using /usr/bin/bison.yacc to provide /usr/bin/yacc (yacc) in auto mode
1095Setting up libcroco3:i386 (0.6.11-1) ...
1096Setting up gettext (0.19.7-2ubuntu3) ...
1097Setting up intltool-debian (0.35.0+20060710.4) ...
1098Setting up po-debconf (1.0.19) ...
1099Setting up libarchive-zip-perl (1.56-2) ...
1100Setting up libfile-stripnondeterminism-perl (0.015-1) ...
1101Setting up libtimedate-perl (2.3000-2) ...
1102Setting up libgfortran3:i386 (5.3.1-14ubuntu2) ...
1103Setting up libgfortran-5-dev:i386 (5.3.1-14ubuntu2) ...
1104Setting up gfortran-5 (5.3.1-14ubuntu2) ...
1105Setting up gfortran (4:5.3.1-1ubuntu1) ...
1106update-alternatives: using /usr/bin/gfortran to provide /usr/bin/f95 (f95) in auto mode
1107update-alternatives: using /usr/bin/gfortran to provide /usr/bin/f77 (f77) in auto mode
1108Setting up hdf5-helpers (1.8.16+docs-4ubuntu1) ...
1109Setting up icu-devtools (55.1-7) ...
1110Setting up libgssrpc4:i386 (1.13.2+dfsg-5) ...
1111Setting up libkdb5-8:i386 (1.13.2+dfsg-5) ...
1112Setting up libkadm5srv-mit9:i386 (1.13.2+dfsg-5) ...
1113Setting up libkadm5clnt-mit9:i386 (1.13.2+dfsg-5) ...
1114Setting up comerr-dev (2.1-1.42.13-1ubuntu1) ...
1115Setting up krb5-multidev (1.13.2+dfsg-5) ...
1116Setting up libaec0:i386 (0.3.2-1) ...
1117Setting up liblapack3 (3.6.0-2ubuntu2) ...
1118update-alternatives: using /usr/lib/lapack/liblapack.so.3 to provide /usr/lib/liblapack.so.3 (liblapack.so.3) in auto mode
1119Setting up libarpack2 (3.3.0-1build2) ...
1120Setting up libarmadillo6 (1:6.500.5+dfsg-1) ...
1121Setting up libblas-dev (3.6.0-2ubuntu2) ...
1122update-alternatives: using /usr/lib/libblas/libblas.so to provide /usr/lib/libblas.so (libblas.so) in auto mode
1123Setting up liblapack-dev (3.6.0-2ubuntu2) ...
1124update-alternatives: using /usr/lib/lapack/liblapack.so to provide /usr/lib/liblapack.so (liblapack.so) in auto mode
1125Setting up libarpack2-dev (3.3.0-1build2) ...
1126Setting up libsz2:i386 (0.3.2-1) ...
1127Setting up libhdf5-10:i386 (1.8.16+docs-4ubuntu1) ...
1128Setting up zlib1g-dev:i386 (1:1.2.8.dfsg-2ubuntu4) ...
1129Setting up libjpeg-turbo8-dev:i386 (1.4.2-0ubuntu3) ...
1130Setting up libjpeg8:i386 (8c-2ubuntu8) ...
1131Setting up libjpeg8-dev:i386 (8c-2ubuntu8) ...
1132Setting up libjpeg-dev:i386 (8c-2ubuntu8) ...
1133Setting up libaec-dev:i386 (0.3.2-1) ...
1134Setting up libhdf5-cpp-11:i386 (1.8.16+docs-4ubuntu1) ...
1135Setting up libhdf5-dev (1.8.16+docs-4ubuntu1) ...
1136update-alternatives: using /usr/lib/i386-linux-gnu/pkgconfig/hdf5-serial.pc to provide /usr/lib/i386-linux-gnu/pkgconfig/hdf5.pc (hdf5.pc) in auto mode
1137Setting up libsuperlu-dev:i386 (4.3+dfsg-3) ...
1138Setting up libarmadillo-dev (1:6.500.5+dfsg-1) ...
1139Setting up libboost1.58-dev:i386 (1.58.0+dfsg-5ubuntu3) ...
1140Setting up libboost-atomic1.58.0:i386 (1.58.0+dfsg-5ubuntu3) ...
1141Setting up libboost-atomic1.58-dev:i386 (1.58.0+dfsg-5ubuntu3) ...
1142Setting up libboost-system1.58.0:i386 (1.58.0+dfsg-5ubuntu3) ...
1143Setting up libboost-chrono1.58.0:i386 (1.58.0+dfsg-5ubuntu3) ...
1144Setting up libboost-chrono1.58-dev:i386 (1.58.0+dfsg-5ubuntu3) ...
1145Setting up libboost-date-time1.58.0:i386 (1.58.0+dfsg-5ubuntu3) ...
1146Setting up libboost-serialization1.58.0:i386 (1.58.0+dfsg-5ubuntu3) ...
1147Setting up libboost-serialization1.58-dev:i386 (1.58.0+dfsg-5ubuntu3) ...
1148Setting up libboost-date-time1.58-dev:i386 (1.58.0+dfsg-5ubuntu3) ...
1149Setting up libboost-dev:i386 (1.58.0.1ubuntu1) ...
1150Setting up libboost-program-options1.58.0:i386 (1.58.0+dfsg-5ubuntu3) ...
1151Setting up libboost-program-options1.58-dev:i386 (1.58.0+dfsg-5ubuntu3) ...
1152Setting up libboost-program-options-dev:i386 (1.58.0.1ubuntu1) ...
1153Setting up libboost-system1.58-dev:i386 (1.58.0+dfsg-5ubuntu3) ...
1154Setting up libboost-system-dev:i386 (1.58.0.1ubuntu1) ...
1155Setting up libboost-thread1.58.0:i386 (1.58.0+dfsg-5ubuntu3) ...
1156Setting up libboost-thread1.58-dev:i386 (1.58.0+dfsg-5ubuntu3) ...
1157Setting up libboost-thread-dev:i386 (1.58.0.1ubuntu1) ...
1158Setting up libpixman-1-0:i386 (0.33.6-1) ...
1159Setting up libxcb-render0:i386 (1.11.1-1ubuntu1) ...
1160Setting up libxcb-shm0:i386 (1.11.1-1ubuntu1) ...
1161Setting up libxrender1:i386 (1:0.9.9-0ubuntu1) ...
1162Setting up libcairo2:i386 (1.14.6-1) ...
1163Setting up libglapi-mesa:i386 (11.2.0-1ubuntu2) ...
1164Setting up libx11-xcb1:i386 (2:1.6.3-1ubuntu2) ...
1165Setting up libxcb-dri2-0:i386 (1.11.1-1ubuntu1) ...
1166Setting up libxcb-dri3-0:i386 (1.11.1-1ubuntu1) ...
1167Setting up libxcb-glx0:i386 (1.11.1-1ubuntu1) ...
1168Setting up libxcb-present0:i386 (1.11.1-1ubuntu1) ...
1169Setting up libxcb-sync1:i386 (1.11.1-1ubuntu1) ...
1170Setting up libdrm-amdgpu1:i386 (2.4.67-1) ...
1171Setting up libpciaccess0:i386 (0.13.4-1) ...
1172Setting up libdrm-intel1:i386 (2.4.67-1) ...
1173Setting up libdrm-nouveau2:i386 (2.4.67-1) ...
1174Setting up libdrm-radeon1:i386 (2.4.67-1) ...
1175Setting up libllvm3.8:i386 (1:3.8-2ubuntu1) ...
1176Setting up libgl1-mesa-dri:i386 (11.2.0-1ubuntu2) ...
1177Setting up libgl1-mesa-glx:i386 (11.2.0-1ubuntu2) ...
1178update-alternatives: using /usr/lib/i386-linux-gnu/mesa/ld.so.conf to provide /etc/ld.so.conf.d/i386-linux-gnu_GL.conf (i386-linux-gnu_gl_conf) in auto mode
1179Setting up libcgal11v5:i386 (4.7-4) ...
1180Setting up libgmpxx4ldbl:i386 (2:6.1.0+dfsg-2) ...
1181Setting up libgmp-dev:i386 (2:6.1.0+dfsg-2) ...
1182Setting up libmpfr-dev:i386 (3.1.4-1) ...
1183Setting up libcgal-dev:i386 (4.7-4) ...
1184Setting up libcrypto++9v5 (5.6.1-9) ...
1185Setting up libcrypto++-dev (5.6.1-9) ...
1186Setting up libcurl4-gnutls-dev:i386 (7.47.0-1ubuntu2) ...
1187Setting up libdap17v5:i386 (3.15.1-7) ...
1188Setting up libdapserver7v5:i386 (3.15.1-7) ...
1189Setting up libdapclient6v5:i386 (3.15.1-7) ...
1190Setting up libicu-dev:i386 (55.1-7) ...
1191Setting up libxml2-dev:i386 (2.9.3+dfsg1-1) ...
1192Setting up uuid-dev:i386 (2.27.1-6ubuntu3) ...
1193Setting up pkg-config (0.29.1-0ubuntu1) ...
1194Setting up libdap-dev:i386 (3.15.1-7) ...
1195Setting up libdatrie1:i386 (0.2.10-2) ...
1196Setting up libepsilon1:i386 (0.9.2-3ubuntu1) ...
1197Setting up libexpat1-dev:i386 (2.1.0-7) ...
1198Setting up libfcgi0ldbl (2.4.0-8.3) ...
1199Setting up libfcgi-dev (2.4.0-8.3) ...
1200Setting up libfreexl1:i386 (1.0.2-1) ...
1201Setting up libgeos-3.5.0 (3.5.0-1ubuntu2) ...
1202Setting up libgeos-c1v5 (3.5.0-1ubuntu2) ...
1203Setting up proj-data (4.9.2-2) ...
1204Setting up libproj9 (4.9.2-2) ...
1205Setting up libtiff5:i386 (4.0.6-1) ...
1206Setting up libgeotiff2:i386 (1.4.1-2) ...
1207Setting up libgif7:i386 (5.1.2-0.2) ...
1208Setting up libhdf4-0-alt (4.2.10-3.2) ...
1209Setting up libminizip1:i386 (1.1-8) ...
1210Setting up liburiparser1:i386 (0.8.4-1) ...
1211Setting up libkmlbase1:i386 (1.3.0-1) ...
1212Setting up libkmldom1:i386 (1.3.0-1) ...
1213Setting up libkmlengine1:i386 (1.3.0-1) ...
1214Setting up mysql-common (5.7.11-0ubuntu6) ...
1215update-alternatives: using /etc/mysql/my.cnf.fallback to provide /etc/mysql/my.cnf (my.cnf) in auto mode
1216Setting up libmysqlclient20:i386 (5.7.11-0ubuntu6) ...
1217Setting up libnetcdf11 (1:4.4.0-2) ...
1218Setting up libltdl7:i386 (2.4.6-0.1) ...
1219Setting up libodbc1:i386 (2.3.1-4.1) ...
1220Setting up libogdi3.2 (3.2.0~beta2-7.1build1) ...
1221Setting up libopenjp2-7:i386 (2.1.0-2.1) ...
1222Setting up libpoppler58:i386 (0.41.0-0ubuntu1) ...
1223Setting up libpq5:i386 (9.5.2-1) ...
1224Setting up libqhull7:i386 (2015.2-1) ...
1225Setting up libspatialite7:i386 (4.3.0a-5) ...
1226Setting up libwebp5:i386 (0.4.4-1) ...
1227Setting up libxerces-c3.1:i386 (3.1.3+debian-1) ...
1228Setting up libepsilon-dev:i386 (0.9.2-3ubuntu1) ...
1229Setting up libfreexl-dev:i386 (1.0.2-1) ...
1230Setting up libgeos-dev (3.5.0-1ubuntu2) ...
1231Setting up libjbig-dev:i386 (2.1-3.1) ...
1232Setting up liblzma-dev:i386 (5.1.1alpha+20120614-2ubuntu2) ...
1233Setting up libtiffxx5:i386 (4.0.6-1) ...
1234Setting up libtiff5-dev:i386 (4.0.6-1) ...
1235Setting up libgeotiff-dev:i386 (1.4.1-2) ...
1236Setting up libgif-dev (5.1.2-0.2) ...
1237Setting up libnetcdf-dev (1:4.4.0-2) ...
1238Setting up libhdf4-alt-dev (4.2.10-3.2) ...
1239Setting up libjson-c-dev:i386 (0.11-4ubuntu2) ...
1240Setting up libkmlconvenience1:i386 (1.3.0-1) ...
1241Setting up libkmlregionator1:i386 (1.3.0-1) ...
1242Setting up libkmlxsd1:i386 (1.3.0-1) ...
1243Setting up libminizip-dev:i386 (1.1-8) ...
1244Setting up liburiparser-dev (0.8.4-1) ...
1245Setting up libkml-dev:i386 (1.3.0-1) ...
1246Setting up libltdl-dev:i386 (2.4.6-0.1) ...
1247Setting up libmysqlclient-dev (5.7.11-0ubuntu6) ...
1248Setting up libproj-dev (4.9.2-2) ...
1249Setting up libogdi3.2-dev (3.2.0~beta2-7.1build1) ...
1250Setting up libopenjp2-7-dev (2.1.0-2.1) ...
1251Setting up libpcre16-3:i386 (2:8.38-3.1) ...
1252Setting up libpcre32-3:i386 (2:8.38-3.1) ...
1253Setting up libpcre3-dev:i386 (2:8.38-3.1) ...
1254Setting up libpng12-dev:i386 (1.2.54-1ubuntu1) ...
1255Setting up libpoppler-dev:i386 (0.41.0-0ubuntu1) ...
1256Setting up libpoppler-private-dev:i386 (0.41.0-0ubuntu1) ...
1257Setting up libssl-dev:i386 (1.0.2g-1ubuntu4) ...
1258Setting up libpq-dev (9.5.2-1) ...
1259Setting up libqhull-dev:i386 (2015.2-1) ...
1260Setting up libsqlite3-dev:i386 (3.11.0-1ubuntu1) ...
1261Setting up libspatialite-dev:i386 (4.3.0a-5) ...
1262Setting up libwebpmux1:i386 (0.4.4-1) ...
1263Setting up libwebpdemux1:i386 (0.4.4-1) ...
1264Setting up libwebp-dev:i386 (0.4.4-1) ...
1265Setting up libxerces-c-dev (3.1.3+debian-1) ...
1266Setting up libgdk-pixbuf2.0-common (2.32.2-1ubuntu1) ...
1267Setting up libgdk-pixbuf2.0-0:i386 (2.32.2-1ubuntu1) ...
1268Setting up libgraphite2-3:i386 (1.3.6-1ubuntu1) ...
1269Setting up libharfbuzz0b:i386 (1.0.1-1build2) ...
1270Setting up libthai-data (0.1.24-2) ...
1271Setting up libthai0:i386 (0.1.24-2) ...
1272Setting up libpango-1.0-0:i386 (1.38.1-1) ...
1273Setting up libpangoft2-1.0-0:i386 (1.38.1-1) ...
1274Setting up libpangocairo-1.0-0:i386 (1.38.1-1) ...
1275Setting up librsvg2-2:i386 (2.40.13-3) ...
1276Setting up libnspr4:i386 (2:4.11-1ubuntu1) ...
1277Setting up libnspr4-dev (2:4.11-1ubuntu1) ...
1278Setting up libpython2.7:i386 (2.7.11-7ubuntu1) ...
1279Setting up libpython2.7-dev:i386 (2.7.11-7ubuntu1) ...
1280Setting up libpython-dev:i386 (2.7.11-1) ...
1281Setting up libxslt1.1:i386 (1.1.28-2.1) ...
1282Setting up libxslt1-dev:i386 (1.1.28-2.1) ...
1283Setting up python-all (2.7.11-1) ...
1284Setting up python2.7-dev (2.7.11-7ubuntu1) ...
1285Setting up python-dev (2.7.11-1) ...
1286Setting up libffi-dev:i386 (3.2.1-4) ...
1287Setting up libmozjs185-1.0 (1.8.5-1.0.0+dfsg-4.5) ...
1288Setting up libmozjs185-dev (1.8.5-1.0.0+dfsg-4.5) ...
1289Setting up odbcinst1debian2:i386 (2.3.1-4.1) ...
1290Setting up libgdal20 (2.1.0+dfsg-1~xenial0) ...
1291Setting up unixodbc (2.3.1-4.1) ...
1292Setting up unixodbc-dev (2.3.1-4.1) ...
1293Setting up libgdal-dev (2.1.0+dfsg-1~xenial0) ...
1294Setting up libmapserver2 (7.0.1-4~xenial1~php5.6) ...
1295Setting up libmapserver-dev (7.0.1-4~xenial1~php5.6) ...
1296Setting up dh-strip-nondeterminism (0.015-1) ...
1297Setting up debhelper (9.20160115ubuntu3) ...
1298Setting up odbcinst (2.3.1-4.1) ...
1299Processing triggers for libc-bin (2.23-0ubuntu3) ...
1300Reading package lists...
1301Building dependency tree...
1302Reading state information...
1303Reading extended state information...
1304Initializing package states...
1305Writing extended state information...
1306Building tag database...
1307 -> Finished parsing the build-deps
1308Reading package lists...
1309Building dependency tree...
1310Reading state information...
1311The following additional packages will be installed:
1312  libfakeroot
1313The following NEW packages will be installed:
1314  fakeroot libfakeroot
1315debconf: delaying package configuration, since apt-utils is not installed
13160 upgraded, 2 newly installed, 0 to remove and 0 not upgraded.
1317Need to get 0 B/90.1 kB of archives.
1318After this operation, 431 kB of additional disk space will be used.
1319Selecting previously unselected package libfakeroot:i386.
1320(Reading database ... (Reading database ... 5% (Reading database ... 10% (Reading database ... 15% (Reading database ... 20% (Reading database ... 25% (Reading database ... 30% (Reading database ... 35% (Reading database ... 40% (Reading database ... 45% (Reading database ... 50% (Reading database ... 55% (Reading database ... 60% (Reading database ... 65% (Reading database ... 70% (Reading database ... 75% (Reading database ... 80% (Reading database ... 85% (Reading database ... 90% (Reading database ... 95% (Reading database ... 100% (Reading database ... 35731 files and directories currently installed.)
1321Preparing to unpack .../libfakeroot_1.20.2-1ubuntu1_i386.deb ...
1322Unpacking libfakeroot:i386 (1.20.2-1ubuntu1) ...
1323Selecting previously unselected package fakeroot.
1324Preparing to unpack .../fakeroot_1.20.2-1ubuntu1_i386.deb ...
1325Unpacking fakeroot (1.20.2-1ubuntu1) ...
1326Processing triggers for man-db (2.7.5-1) ...
1327Setting up libfakeroot:i386 (1.20.2-1ubuntu1) ...
1328Setting up fakeroot (1.20.2-1ubuntu1) ...
1329update-alternatives: using /usr/bin/fakeroot-sysv to provide /usr/bin/fakeroot (fakeroot) in auto mode
1330I: Copying back the cached apt archive contents
1331I: Copying source file
1332I: copying [/home/user/packaging/zoo-project_1.6.0~rev771-0~xenial0.dsc]
1333I: copying [/home/user/packaging/zoo-project_1.6.0~rev771.orig.tar.xz]
1334I: copying [/home/user/packaging/zoo-project_1.6.0~rev771-0~xenial0.debian.tar.gz]
1335I: Extracting source
1336gpgv: Signature made Sat Jun 11 11:00:48 2016 UTC using RSA key ID 9DE8C44C
1337gpgv: Can't check signature: public key not found
1338dpkg-source: warning: failed to verify signature on ./zoo-project_1.6.0~rev771-0~xenial0.dsc
1339dpkg-source: info: extracting zoo-project in zoo-project-1.6.0~rev771
1340dpkg-source: info: unpacking zoo-project_1.6.0~rev771.orig.tar.xz
1341dpkg-source: info: unpacking zoo-project_1.6.0~rev771-0~xenial0.debian.tar.gz
1342I: Building the package
1343I: Running cd tmp/buildd/*/ && env PATH="/usr/sbin:/usr/bin:/sbin:/bin" dpkg-buildpackage -us -uc  -rfakeroot
1344dpkg-buildpackage: source package zoo-project
1345dpkg-buildpackage: source version 1.6.0~rev771-0~xenial0
1346dpkg-buildpackage: source distribution xenial
1347dpkg-buildpackage: source changed by Angelos Tzotsos <gcpp.kalxas@gmail.com>
1348 dpkg-source --before-build zoo-project-1.6.0~rev771
1349dpkg-buildpackage: host architecture i386
1350 fakeroot debian/rules clean
1351dh  clean
1352   dh_testdir
1353   dh_auto_clean
1354   dh_clean
1355 dpkg-source -b zoo-project-1.6.0~rev771
1356dpkg-source: info: using source format '3.0 (quilt)'
1357dpkg-source: info: building zoo-project using existing ./zoo-project_1.6.0~rev771.orig.tar.xz
1358dpkg-source: info: building zoo-project in zoo-project_1.6.0~rev771-0~xenial0.debian.tar.xz
1359dpkg-source: info: building zoo-project in zoo-project_1.6.0~rev771-0~xenial0.dsc
1360 debian/rules build
1361dh  build
1362   dh_testdir
1363   dh_update_autotools_config
1364   debian/rules override_dh_auto_configure
1365make[1]: Entering directory '/tmp/buildd/zoo-project-1.6.0~rev771'
1366cd zoo-project/zoo-kernel && autoconf && ./configure --with-python --with-js --with-mapserver=/usr --with-ms-version=7
1367checking for bison... bison -y
1368checking for gcc... gcc
1369checking whether the C compiler works... yes
1370checking for C compiler default output file name... a.out
1371checking for suffix of executables...
1372checking whether we are cross compiling... no
1373checking for suffix of object files... o
1374checking whether we are using the GNU C compiler... yes
1375checking whether gcc accepts -g... yes
1376checking for gcc option to accept ISO C89... none needed
1377checking for flex... flex
1378checking lex output file root... lex.yy
1379checking lex library... -lfl
1380checking whether yytext is a pointer... yes
1381checking for g++... g++
1382checking whether we are using the GNU C++ compiler... yes
1383checking whether g++ accepts -g... yes
1384checking for a sed that does not truncate output... /bin/sed
1385checking for curl_easy_init,curl_easy_setopt,curl_easy_cleanup,curl_easy_perform in -lcurl... yes
1386checking for dlopen,dlsym,dlerror,dlclose in -ldl... yes
1387checking for EVP_DigestInit,EVP_md5,EVP_DigestUpdate,BIO_f_base64,BIO_new in -lcrypto... yes
1388checking for uuid_generate_time in -luuid... yes
1389checking how to run the C preprocessor... gcc -E
1390checking for grep that handles long lines and -e... /bin/grep
1391checking for egrep... /bin/grep -E
1392checking for ANSI C header files... yes
1393checking for sys/types.h... yes
1394checking for sys/stat.h... yes
1395checking for stdlib.h... yes
1396checking for string.h... yes
1397checking for memory.h... yes
1398checking for strings.h... yes
1399checking for inttypes.h... yes
1400checking for stdint.h... yes
1401checking for unistd.h... yes
1402checking for size_t... yes
1403checking for working alloca.h... yes
1404checking for alloca... yes
1405checking fcntl.h usability... yes
1406checking fcntl.h presence... yes
1407checking for fcntl.h... yes
1408checking for inttypes.h... (cached) yes
1409checking libintl.h usability... yes
1410checking libintl.h presence... yes
1411checking for libintl.h... yes
1412checking malloc.h usability... yes
1413checking malloc.h presence... yes
1414checking for malloc.h... yes
1415checking stddef.h usability... yes
1416checking stddef.h presence... yes
1417checking for stddef.h... yes
1418checking for stdlib.h... (cached) yes
1419checking for string.h... (cached) yes
1420checking for unistd.h... (cached) yes
1421checking for stdbool.h that conforms to C99... yes
1422checking for _Bool... yes
1423checking for int16_t... yes
1424checking for int32_t... yes
1425checking for int8_t... yes
1426checking for pid_t... yes
1427checking for size_t... (cached) yes
1428checking for uint16_t... yes
1429checking for uint32_t... yes
1430checking for uint8_t... yes
1431checking vfork.h usability... no
1432checking vfork.h presence... no
1433checking for vfork.h... no
1434checking for fork... yes
1435checking for vfork... yes
1436checking for working fork... yes
1437checking for working vfork... (cached) yes
1438checking for stdlib.h... (cached) yes
1439checking for GNU libc compatible malloc... yes
1440checking for stdlib.h... (cached) yes
1441checking for GNU libc compatible realloc... yes
1442checking for dup2... yes
1443checking for getcwd... yes
1444checking for memset... yes
1445checking for setenv... yes
1446checking for strdup... yes
1447checking for strstr... yes
1448checking openssl/md5.h usability... yes
1449checking openssl/md5.h presence... yes
1450checking for openssl/md5.h... yes
1451checking openssl/hmac.h usability... yes
1452checking openssl/hmac.h presence... yes
1453checking for openssl/hmac.h... yes
1454checking openssl/evp.h usability... yes
1455checking openssl/evp.h presence... yes
1456checking for openssl/evp.h... yes
1457checking openssl/bio.h usability... yes
1458checking openssl/bio.h presence... yes
1459checking for openssl/bio.h... yes
1460checking openssl/buffer.h usability... yes
1461checking openssl/buffer.h presence... yes
1462checking for openssl/buffer.h... yes
1463checking for BIO_f_base64 in -lcrypto... yes
1464checking for main in -lfcgi... yes
1465checking fcgi_stdio.h usability... yes
1466checking fcgi_stdio.h presence... yes
1467checking for fcgi_stdio.h... yes
1468checking for xml2-config... /usr/bin/xml2-config
1469checking libxml/tree.h usability... yes
1470checking libxml/tree.h presence... yes
1471checking for libxml/tree.h... yes
1472checking libxml/parser.h usability... yes
1473checking libxml/parser.h presence... yes
1474checking for libxml/parser.h... yes
1475checking libxml/xpath.h usability... yes
1476checking libxml/xpath.h presence... yes
1477checking for libxml/xpath.h... yes
1478checking libxml/xpathInternals.h usability... yes
1479checking libxml/xpathInternals.h presence... yes
1480checking for libxml/xpathInternals.h... yes
1481checking for xmlInitParser in -lxml2... yes
1482checking for xslt-config... /usr/bin/xslt-config
1483checking libxslt/xslt.h usability... yes
1484checking libxslt/xslt.h presence... yes
1485checking for libxslt/xslt.h... yes
1486checking libxslt/xsltInternals.h usability... yes
1487checking libxslt/xsltInternals.h presence... yes
1488checking for libxslt/xsltInternals.h... yes
1489checking libxslt/transform.h usability... yes
1490checking libxslt/transform.h presence... yes
1491checking for libxslt/transform.h... yes
1492checking libxslt/xsltutils.h usability... yes
1493checking libxslt/xsltutils.h presence... yes
1494checking for libxslt/xsltutils.h... yes
1495checking for gdal-config... /usr/bin/gdal-config
1496checking proj_api.h usability... yes
1497checking proj_api.h presence... yes
1498checking for proj_api.h... yes
1499checking for geos-config... /usr/bin/geos-config
1500checking geos_c.h usability... yes
1501checking geos_c.h presence... yes
1502checking for geos_c.h... yes
1503checking CGAL/Delaunay_triangulation_2.h usability... no
1504checking CGAL/Delaunay_triangulation_2.h presence... no
1505checking for CGAL/Delaunay_triangulation_2.h... no
1506configure: WARNING: could not find headers include related to libCGAL
1507Using user-specified MapServer src path: /usr
1508checking for python-config... /usr/bin/python-config
1509checking Python.h usability... yes
1510checking Python.h presence... yes
1511checking for Python.h... yes
1512checking for PyObject_CallObject in -lpython2.7... yes
1513checking how to run the C++ preprocessor... g++ -E
1514checking jsapi.h usability... yes
1515checking jsapi.h presence... yes
1516checking for jsapi.h... yes
1517checking for JS_CompileFile,JS_CallFunctionName in -lmozjs185... yes
1518configure: creating ./config.status
1519config.status: creating Makefile
1520config.status: creating ZOOMakefile.opts
1521make[1]: Leaving directory '/tmp/buildd/zoo-project-1.6.0~rev771'
1522   debian/rules override_dh_auto_build
1523make[1]: Entering directory '/tmp/buildd/zoo-project-1.6.0~rev771'
1524dh_auto_build --builddirectory thirds/cgic206
1525        make -j1
1526make[2]: Entering directory '/tmp/buildd/zoo-project-1.6.0~rev771/thirds/cgic206'
1527gcc -g -Wall  -Wdate-time -D_FORTIFY_SOURCE=2  -c -o cgic.o cgic.c
1528rm -f libcgic.a
1529ar rc libcgic.a cgic.o
1530ranlib libcgic.a
1531gcc -g -Wall  -Wdate-time -D_FORTIFY_SOURCE=2  -c -o cgictest.o cgictest.c
1532cgictest.c: In function 'cgiMain':
1533cgictest.c:25:2: warning: implicit declaration of function 'dup2' [-Wimplicit-function-declaration]
1534  dup2(cgiOut,stdout);
1535  ^
1536gcc cgictest.o -o cgictest.cgi -L./ -lcgic /usr/lib/libfcgi.a
1537gcc -g -Wall  -Wdate-time -D_FORTIFY_SOURCE=2  -c -o capture.o capture.c
1538gcc capture.o -o capture -L./ -lcgic /usr/lib/libfcgi.a
1539make[2]: Leaving directory '/tmp/buildd/zoo-project-1.6.0~rev771/thirds/cgic206'
1540dh_auto_build --builddirectory zoo-project/zoo-kernel
1541        make -j1
1542make[2]: Entering directory '/tmp/buildd/zoo-project-1.6.0~rev771/zoo-project/zoo-kernel'
1543echo "#define ZOO_VERSION \"`svnversion`\"" > version.h
1544/bin/sh: 1: svnversion: not found
1545gcc -I/usr/include/gdal -DUSE_JS -I/usr/include/js/ -I/usr/include/libxml2 -DDEB -fpic -I/usr//include -I/usr/include   -DUSE_MS -I/usr/include/mapserver  -I../../thirds/cgic206 -I. -DLINUX_FREE_ISSUE  -fPIC -c service_internal.c
1546service_internal.c: In function '_getStatus':
1547service_internal.c:192:20: warning: initialization makes integer from pointer without a cast [-Wint-conversion]
1548     semid lockid = NULL;
1549                    ^
1550service_internal.c: In function '_updateStatus':
1551service_internal.c:273:20: warning: initialization makes integer from pointer without a cast [-Wint-conversion]
1552     semid lockid = NULL;
1553                    ^
1554service_internal.c: In function 'setOutputValue':
1555service_internal.c:729:18: warning: format '%lu' expects argument of type 'long unsigned int', but argument 3 has type 'size_t {aka unsigned int}' [-Wformat=]
1556     sprintf(size,"%lu",numberOfBytes);
1557                  ^
1558service_internal.c: In function 'readVSIFile':
1559service_internal.c:690:5: warning: ignoring return value of 'VSIStatL', declared with attribute warn_unused_result [-Wunused-result]
1560     VSIStatL(dataSource, &file_status);
1561     ^
1562gcc  -I/usr/include/libxml2 -DDEB -fpic -I/usr//include -I/usr/include   -DUSE_MS -I/usr/include/mapserver  -I../../thirds/cgic206 -I. -DLINUX_FREE_ISSUE  -fPIC -c service.c
1563g++ -fPIC -I/usr/include/gdal -I/usr/include/libxml2 -DDEB -fpic -I/usr//include -I/usr/include   -DUSE_MS -I/usr/include/mapserver  -I../../thirds/cgic206 -I. -DLINUX_FREE_ISSUE  -I/usr/include/js/ -DUSE_JS -c sqlapi.c
1564gcc -shared  -I/usr/include/gdal -Wl,-soname,libzoo_service.so.1.5 -fpic -o libzoo_service.so -DDEB -fpic -I/usr//include -I/usr/include   -DUSE_MS -I/usr/include/mapserver  -I../../thirds/cgic206 -I. -DLINUX_FREE_ISSUE   service_internal.o service.o sqlapi.o -L/usr/lib -lfcgi -L/usr/lib -lgdal
1565g++ -g -O2 -I/usr/include/libxml2 -DDEB -fpic -I/usr//include -I/usr/include   -DUSE_MS -I/usr/include/mapserver  -I../../thirds/cgic206 -I. -DLINUX_FREE_ISSUE    -I/usr/include/python2.7 -I/usr/include/i386-linux-gnu/python2.7  -I/usr/include/js/     -DUSE_PYTHON -DUSE_JS    -c zoo_service_loader.c  -fno-common -DPIC -o zoo_service_loader.o
1566zoo_service_loader.c:31:20: error: expected unqualified-id before 'sizeof'
1567 #define length(x) (sizeof(x) / sizeof(x[0]))
1568                    ^
1569zoo_service_loader.c:31:20: error: expected ')' before 'sizeof'
1570zoo_service_loader.c:31:19: error: expected unqualified-id before '(' token
1571 #define length(x) (sizeof(x) / sizeof(x[0]))
1572                   ^
1573zoo_service_loader.c:31:20: error: expected unqualified-id before 'sizeof'
1574 #define length(x) (sizeof(x) / sizeof(x[0]))
1575                    ^
1576zoo_service_loader.c:31:20: error: expected ')' before 'sizeof'
1577zoo_service_loader.c:31:19: error: expected unqualified-id before '(' token
1578 #define length(x) (sizeof(x) / sizeof(x[0]))
1579                   ^
1580zoo_service_loader.c:31:20: error: expected unqualified-id before 'sizeof'
1581 #define length(x) (sizeof(x) / sizeof(x[0]))
1582                    ^
1583zoo_service_loader.c:31:20: error: expected ')' before 'sizeof'
1584zoo_service_loader.c:31:20: error: expected unqualified-id before 'sizeof'
1585 #define length(x) (sizeof(x) / sizeof(x[0]))
1586                    ^
1587zoo_service_loader.c:31:20: error: expected ')' before 'sizeof'
1588zoo_service_loader.c:31:20: error: expected unqualified-id before 'sizeof'
1589 #define length(x) (sizeof(x) / sizeof(x[0]))
1590                    ^
1591zoo_service_loader.c:31:20: error: expected ')' before 'sizeof'
1592/usr/include/c++/5/bits/basic_string.h: In copy constructor 'std::__cxx11::basic_string<_CharT, _Traits, _Alloc>::basic_string(const std::__cxx11::basic_string<_CharT, _Traits, _Alloc>&)':
1593zoo_service_loader.c:31:19: error: expected unqualified-id before '(' token
1594 #define length(x) (sizeof(x) / sizeof(x[0]))
1595                   ^
1596zoo_service_loader.c:31:28: error: expected primary-expression before ')' token
1597 #define length(x) (sizeof(x) / sizeof(x[0]))
1598                            ^
1599zoo_service_loader.c:31:40: error: lambda-expression in unevaluated context
1600 #define length(x) (sizeof(x) / sizeof(x[0]))
1601                                        ^
1602zoo_service_loader.c:31:41: error: expected identifier before numeric constant
1603 #define length(x) (sizeof(x) / sizeof(x[0]))
1604                                         ^
1605zoo_service_loader.c:31:43: error: expected '{' before ')' token
1606 #define length(x) (sizeof(x) / sizeof(x[0]))
1607                                           ^
1608zoo_service_loader.c:31:43: warning: lambda expressions only available with -std=c++11 or -std=gnu++11
1609/usr/include/c++/5/bits/basic_string.h: In constructor 'std::__cxx11::basic_string<_CharT, _Traits, _Alloc>::basic_string(const _CharT*, const _Alloc&)':
1610zoo_service_loader.c:31:19: error: expected unqualified-id before '(' token
1611 #define length(x) (sizeof(x) / sizeof(x[0]))
1612                   ^
1613/usr/include/c++/5/bits/basic_string.h: In member function 'std::__cxx11::basic_string<_CharT, _Traits, _Alloc>& std::__cxx11::basic_string<_CharT, _Traits, _Alloc>::append(const _CharT*)':
1614zoo_service_loader.c:31:19: error: expected unqualified-id before '(' token
1615 #define length(x) (sizeof(x) / sizeof(x[0]))
1616                   ^
1617/usr/include/c++/5/bits/basic_string.h: In member function 'std::__cxx11::basic_string<_CharT, _Traits, _Alloc>& std::__cxx11::basic_string<_CharT, _Traits, _Alloc>::assign(const _CharT*)':
1618zoo_service_loader.c:31:19: error: expected unqualified-id before '(' token
1619 #define length(x) (sizeof(x) / sizeof(x[0]))
1620                   ^
1621/usr/include/c++/5/bits/basic_string.h: In member function 'std::__cxx11::basic_string<_CharT, _Traits, _Alloc>& std::__cxx11::basic_string<_CharT, _Traits, _Alloc>::insert(std::__cxx11::basic_string<_CharT, _Traits, _Alloc>::size_type, const _CharT*)':
1622zoo_service_loader.c:31:19: error: expected unqualified-id before '(' token
1623 #define length(x) (sizeof(x) / sizeof(x[0]))
1624                   ^
1625/usr/include/c++/5/bits/basic_string.h: In member function 'std::__cxx11::basic_string<_CharT, _Traits, _Alloc>& std::__cxx11::basic_string<_CharT, _Traits, _Alloc>::replace(std::__cxx11::basic_string<_CharT, _Traits, _Alloc>::size_type, std::__cxx11::basic_string<_CharT, _Traits, _Alloc>::size_type, const _CharT*)':
1626zoo_service_loader.c:31:19: error: expected unqualified-id before '(' token
1627 #define length(x) (sizeof(x) / sizeof(x[0]))
1628                   ^
1629/usr/include/c++/5/bits/basic_string.h: In member function 'std::__cxx11::basic_string<_CharT, _Traits, _Alloc>& std::__cxx11::basic_string<_CharT, _Traits, _Alloc>::replace(std::__cxx11::basic_string<_CharT, _Traits, _Alloc>::__const_iterator, std::__cxx11::basic_string<_CharT, _Traits, _Alloc>::__const_iterator, const _CharT*)':
1630zoo_service_loader.c:31:19: error: expected unqualified-id before '(' token
1631 #define length(x) (sizeof(x) / sizeof(x[0]))
1632                   ^
1633/usr/include/c++/5/bits/basic_string.h: In member function 'std::__cxx11::basic_string<_CharT, _Traits, _Alloc>::size_type std::__cxx11::basic_string<_CharT, _Traits, _Alloc>::find(const _CharT*, std::__cxx11::basic_string<_CharT, _Traits, _Alloc>::size_type) const':
1634zoo_service_loader.c:31:19: error: expected unqualified-id before '(' token
1635 #define length(x) (sizeof(x) / sizeof(x[0]))
1636                   ^
1637/usr/include/c++/5/bits/basic_string.h: In member function 'std::__cxx11::basic_string<_CharT, _Traits, _Alloc>::size_type std::__cxx11::basic_string<_CharT, _Traits, _Alloc>::rfind(const _CharT*, std::__cxx11::basic_string<_CharT, _Traits, _Alloc>::size_type) const':
1638zoo_service_loader.c:31:19: error: expected unqualified-id before '(' token
1639 #define length(x) (sizeof(x) / sizeof(x[0]))
1640                   ^
1641/usr/include/c++/5/bits/basic_string.h: In member function 'std::__cxx11::basic_string<_CharT, _Traits, _Alloc>::size_type std::__cxx11::basic_string<_CharT, _Traits, _Alloc>::find_first_of(const _CharT*, std::__cxx11::basic_string<_CharT, _Traits, _Alloc>::size_type) const':
1642zoo_service_loader.c:31:19: error: expected unqualified-id before '(' token
1643 #define length(x) (sizeof(x) / sizeof(x[0]))
1644                   ^
1645/usr/include/c++/5/bits/basic_string.h: In member function 'std::__cxx11::basic_string<_CharT, _Traits, _Alloc>::size_type std::__cxx11::basic_string<_CharT, _Traits, _Alloc>::find_last_of(const _CharT*, std::__cxx11::basic_string<_CharT, _Traits, _Alloc>::size_type) const':
1646zoo_service_loader.c:31:19: error: expected unqualified-id before '(' token
1647 #define length(x) (sizeof(x) / sizeof(x[0]))
1648                   ^
1649/usr/include/c++/5/bits/basic_string.h: In member function 'std::__cxx11::basic_string<_CharT, _Traits, _Alloc>::size_type std::__cxx11::basic_string<_CharT, _Traits, _Alloc>::find_first_not_of(const _CharT*, std::__cxx11::basic_string<_CharT, _Traits, _Alloc>::size_type) const':
1650zoo_service_loader.c:31:19: error: expected unqualified-id before '(' token
1651 #define length(x) (sizeof(x) / sizeof(x[0]))
1652                   ^
1653/usr/include/c++/5/bits/basic_string.h: In member function 'std::__cxx11::basic_string<_CharT, _Traits, _Alloc>::size_type std::__cxx11::basic_string<_CharT, _Traits, _Alloc>::find_last_not_of(const _CharT*, std::__cxx11::basic_string<_CharT, _Traits, _Alloc>::size_type) const':
1654zoo_service_loader.c:31:19: error: expected unqualified-id before '(' token
1655 #define length(x) (sizeof(x) / sizeof(x[0]))
1656                   ^
1657/usr/include/c++/5/bits/basic_string.tcc: In member function 'void std::__cxx11::basic_string<_CharT, _Traits, _Alloc>::swap(std::__cxx11::basic_string<_CharT, _Traits, _Alloc>&)':
1658zoo_service_loader.c:31:28: error: expected primary-expression before ')' token
1659 #define length(x) (sizeof(x) / sizeof(x[0]))
1660                            ^
1661zoo_service_loader.c:31:40: error: lambda-expression in unevaluated context
1662 #define length(x) (sizeof(x) / sizeof(x[0]))
1663                                        ^
1664zoo_service_loader.c:31:41: error: expected identifier before numeric constant
1665 #define length(x) (sizeof(x) / sizeof(x[0]))
1666                                         ^
1667zoo_service_loader.c:31:43: error: expected '{' before ')' token
1668 #define length(x) (sizeof(x) / sizeof(x[0]))
1669                                           ^
1670zoo_service_loader.c:31:43: warning: lambda expressions only available with -std=c++11 or -std=gnu++11
1671zoo_service_loader.c:31:19: error: expected unqualified-id before '(' token
1672 #define length(x) (sizeof(x) / sizeof(x[0]))
1673                   ^
1674zoo_service_loader.c:31:28: error: expected primary-expression before ')' token
1675 #define length(x) (sizeof(x) / sizeof(x[0]))
1676                            ^
1677zoo_service_loader.c:31:40: error: lambda-expression in unevaluated context
1678 #define length(x) (sizeof(x) / sizeof(x[0]))
1679                                        ^
1680zoo_service_loader.c:31:41: error: expected identifier before numeric constant
1681 #define length(x) (sizeof(x) / sizeof(x[0]))
1682                                         ^
1683zoo_service_loader.c:31:43: error: expected '{' before ')' token
1684 #define length(x) (sizeof(x) / sizeof(x[0]))
1685                                           ^
1686zoo_service_loader.c:31:43: warning: lambda expressions only available with -std=c++11 or -std=gnu++11
1687zoo_service_loader.c:31:19: error: expected unqualified-id before '(' token
1688 #define length(x) (sizeof(x) / sizeof(x[0]))
1689                   ^
1690zoo_service_loader.c:31:28: error: expected primary-expression before ')' token
1691 #define length(x) (sizeof(x) / sizeof(x[0]))
1692                            ^
1693zoo_service_loader.c:31:40: error: lambda-expression in unevaluated context
1694 #define length(x) (sizeof(x) / sizeof(x[0]))
1695                                        ^
1696zoo_service_loader.c:31:41: error: expected identifier before numeric constant
1697 #define length(x) (sizeof(x) / sizeof(x[0]))
1698                                         ^
1699zoo_service_loader.c:31:43: error: expected '{' before ')' token
1700 #define length(x) (sizeof(x) / sizeof(x[0]))
1701                                           ^
1702zoo_service_loader.c:31:43: warning: lambda expressions only available with -std=c++11 or -std=gnu++11
1703zoo_service_loader.c:31:19: error: expected unqualified-id before '(' token
1704 #define length(x) (sizeof(x) / sizeof(x[0]))
1705                   ^
1706zoo_service_loader.c:31:28: error: expected primary-expression before ')' token
1707 #define length(x) (sizeof(x) / sizeof(x[0]))
1708                            ^
1709zoo_service_loader.c:31:40: error: lambda-expression in unevaluated context
1710 #define length(x) (sizeof(x) / sizeof(x[0]))
1711                                        ^
1712zoo_service_loader.c:31:41: error: expected identifier before numeric constant
1713 #define length(x) (sizeof(x) / sizeof(x[0]))
1714                                         ^
1715zoo_service_loader.c:31:43: error: expected '{' before ')' token
1716 #define length(x) (sizeof(x) / sizeof(x[0]))
1717                                           ^
1718zoo_service_loader.c:31:43: warning: lambda expressions only available with -std=c++11 or -std=gnu++11
1719zoo_service_loader.c:31:28: error: expected primary-expression before ')' token
1720 #define length(x) (sizeof(x) / sizeof(x[0]))
1721                            ^
1722zoo_service_loader.c:31:40: error: lambda-expression in unevaluated context
1723 #define length(x) (sizeof(x) / sizeof(x[0]))
1724                                        ^
1725zoo_service_loader.c:31:41: error: expected identifier before numeric constant
1726 #define length(x) (sizeof(x) / sizeof(x[0]))
1727                                         ^
1728zoo_service_loader.c:31:43: error: expected '{' before ')' token
1729 #define length(x) (sizeof(x) / sizeof(x[0]))
1730                                           ^
1731zoo_service_loader.c:31:43: warning: lambda expressions only available with -std=c++11 or -std=gnu++11
1732zoo_service_loader.c:31:28: error: expected primary-expression before ')' token
1733 #define length(x) (sizeof(x) / sizeof(x[0]))
1734                            ^
1735zoo_service_loader.c:31:40: error: lambda-expression in unevaluated context
1736 #define length(x) (sizeof(x) / sizeof(x[0]))
1737                                        ^
1738zoo_service_loader.c:31:41: error: expected identifier before numeric constant
1739 #define length(x) (sizeof(x) / sizeof(x[0]))
1740                                         ^
1741zoo_service_loader.c:31:43: error: expected '{' before ')' token
1742 #define length(x) (sizeof(x) / sizeof(x[0]))
1743                                           ^
1744zoo_service_loader.c:31:43: warning: lambda expressions only available with -std=c++11 or -std=gnu++11
1745zoo_service_loader.c:31:28: error: expected primary-expression before ')' token
1746 #define length(x) (sizeof(x) / sizeof(x[0]))
1747                            ^
1748zoo_service_loader.c:31:40: error: lambda-expression in unevaluated context
1749 #define length(x) (sizeof(x) / sizeof(x[0]))
1750                                        ^
1751zoo_service_loader.c:31:41: error: expected identifier before numeric constant
1752 #define length(x) (sizeof(x) / sizeof(x[0]))
1753                                         ^
1754zoo_service_loader.c:31:43: error: expected '{' before ')' token
1755 #define length(x) (sizeof(x) / sizeof(x[0]))
1756                                           ^
1757zoo_service_loader.c:31:43: warning: lambda expressions only available with -std=c++11 or -std=gnu++11
1758zoo_service_loader.c:31:19: error: expected unqualified-id before '(' token
1759 #define length(x) (sizeof(x) / sizeof(x[0]))
1760                   ^
1761zoo_service_loader.c:31:28: error: expected primary-expression before ')' token
1762 #define length(x) (sizeof(x) / sizeof(x[0]))
1763                            ^
1764zoo_service_loader.c:31:40: error: lambda-expression in unevaluated context
1765 #define length(x) (sizeof(x) / sizeof(x[0]))
1766                                        ^
1767zoo_service_loader.c:31:41: error: expected identifier before numeric constant
1768 #define length(x) (sizeof(x) / sizeof(x[0]))
1769                                         ^
1770zoo_service_loader.c:31:43: error: expected '{' before ')' token
1771 #define length(x) (sizeof(x) / sizeof(x[0]))
1772                                           ^
1773zoo_service_loader.c:31:43: warning: lambda expressions only available with -std=c++11 or -std=gnu++11
1774/usr/include/c++/5/bits/basic_string.tcc: In member function 'void std::__cxx11::basic_string<_CharT, _Traits, _Alloc>::_M_assign(const std::__cxx11::basic_string<_CharT, _Traits, _Alloc>&)':
1775zoo_service_loader.c:31:19: error: expected unqualified-id before '(' token
1776 #define length(x) (sizeof(x) / sizeof(x[0]))
1777                   ^
1778zoo_service_loader.c:31:28: error: expected primary-expression before ')' token
1779 #define length(x) (sizeof(x) / sizeof(x[0]))
1780                            ^
1781zoo_service_loader.c:31:40: error: lambda-expression in unevaluated context
1782 #define length(x) (sizeof(x) / sizeof(x[0]))
1783                                        ^
1784zoo_service_loader.c:31:41: error: expected identifier before numeric constant
1785 #define length(x) (sizeof(x) / sizeof(x[0]))
1786                                         ^
1787zoo_service_loader.c:31:43: error: expected '{' before ')' token
1788 #define length(x) (sizeof(x) / sizeof(x[0]))
1789                                           ^
1790zoo_service_loader.c:31:43: warning: lambda expressions only available with -std=c++11 or -std=gnu++11
1791/usr/include/c++/5/bits/basic_string.tcc: In member function 'void std::__cxx11::basic_string<_CharT, _Traits, _Alloc>::reserve(std::__cxx11::basic_string<_CharT, _Traits, _Alloc>::size_type)':
1792zoo_service_loader.c:31:28: error: expected primary-expression before ')' token
1793 #define length(x) (sizeof(x) / sizeof(x[0]))
1794                            ^
1795zoo_service_loader.c:31:40: error: lambda-expression in unevaluated context
1796 #define length(x) (sizeof(x) / sizeof(x[0]))
1797                                        ^
1798zoo_service_loader.c:31:41: error: expected identifier before numeric constant
1799 #define length(x) (sizeof(x) / sizeof(x[0]))
1800                                         ^
1801zoo_service_loader.c:31:43: error: expected '{' before ')' token
1802 #define length(x) (sizeof(x) / sizeof(x[0]))
1803                                           ^
1804zoo_service_loader.c:31:43: warning: lambda expressions only available with -std=c++11 or -std=gnu++11
1805zoo_service_loader.c:31:28: error: expected primary-expression before ')' token
1806 #define length(x) (sizeof(x) / sizeof(x[0]))
1807                            ^
1808zoo_service_loader.c:31:40: error: lambda-expression in unevaluated context
1809 #define length(x) (sizeof(x) / sizeof(x[0]))
1810                                        ^
1811zoo_service_loader.c:31:41: error: expected identifier before numeric constant
1812 #define length(x) (sizeof(x) / sizeof(x[0]))
1813                                         ^
1814zoo_service_loader.c:31:43: error: expected '{' before ')' token
1815 #define length(x) (sizeof(x) / sizeof(x[0]))
1816                                           ^
1817zoo_service_loader.c:31:43: warning: lambda expressions only available with -std=c++11 or -std=gnu++11
1818zoo_service_loader.c:31:28: error: expected primary-expression before ')' token
1819 #define length(x) (sizeof(x) / sizeof(x[0]))
1820                            ^
1821zoo_service_loader.c:31:40: error: lambda-expression in unevaluated context
1822 #define length(x) (sizeof(x) / sizeof(x[0]))
1823                                        ^
1824zoo_service_loader.c:31:41: error: expected identifier before numeric constant
1825 #define length(x) (sizeof(x) / sizeof(x[0]))
1826                                         ^
1827zoo_service_loader.c:31:43: error: expected '{' before ')' token
1828 #define length(x) (sizeof(x) / sizeof(x[0]))
1829                                           ^
1830zoo_service_loader.c:31:43: warning: lambda expressions only available with -std=c++11 or -std=gnu++11
1831zoo_service_loader.c:31:28: error: expected primary-expression before ')' token
1832 #define length(x) (sizeof(x) / sizeof(x[0]))
1833                            ^
1834zoo_service_loader.c:31:40: error: lambda-expression in unevaluated context
1835 #define length(x) (sizeof(x) / sizeof(x[0]))
1836                                        ^
1837zoo_service_loader.c:31:41: error: expected identifier before numeric constant
1838 #define length(x) (sizeof(x) / sizeof(x[0]))
1839                                         ^
1840zoo_service_loader.c:31:43: error: expected '{' before ')' token
1841 #define length(x) (sizeof(x) / sizeof(x[0]))
1842                                           ^
1843zoo_service_loader.c:31:43: warning: lambda expressions only available with -std=c++11 or -std=gnu++11
1844/usr/include/c++/5/bits/basic_string.tcc: In member function 'void std::__cxx11::basic_string<_CharT, _Traits, _Alloc>::_M_mutate(std::__cxx11::basic_string<_CharT, _Traits, _Alloc>::size_type, std::__cxx11::basic_string<_CharT, _Traits, _Alloc>::size_type, const _CharT*, std::__cxx11::basic_string<_CharT, _Traits, _Alloc>::size_type)':
1845zoo_service_loader.c:31:28: error: expected primary-expression before ')' token
1846 #define length(x) (sizeof(x) / sizeof(x[0]))
1847                            ^
1848zoo_service_loader.c:31:40: error: lambda-expression in unevaluated context
1849 #define length(x) (sizeof(x) / sizeof(x[0]))
1850                                        ^
1851zoo_service_loader.c:31:41: error: expected identifier before numeric constant
1852 #define length(x) (sizeof(x) / sizeof(x[0]))
1853                                         ^
1854zoo_service_loader.c:31:43: error: expected '{' before ')' token
1855 #define length(x) (sizeof(x) / sizeof(x[0]))
1856                                           ^
1857zoo_service_loader.c:31:43: warning: lambda expressions only available with -std=c++11 or -std=gnu++11
1858zoo_service_loader.c:31:28: error: expected primary-expression before ')' token
1859 #define length(x) (sizeof(x) / sizeof(x[0]))
1860                            ^
1861zoo_service_loader.c:31:40: error: lambda-expression in unevaluated context
1862 #define length(x) (sizeof(x) / sizeof(x[0]))
1863                                        ^
1864zoo_service_loader.c:31:41: error: expected identifier before numeric constant
1865 #define length(x) (sizeof(x) / sizeof(x[0]))
1866                                         ^
1867zoo_service_loader.c:31:43: error: expected '{' before ')' token
1868 #define length(x) (sizeof(x) / sizeof(x[0]))
1869                                           ^
1870zoo_service_loader.c:31:43: warning: lambda expressions only available with -std=c++11 or -std=gnu++11
1871/usr/include/c++/5/bits/basic_string.tcc: In member function 'void std::__cxx11::basic_string<_CharT, _Traits, _Alloc>::_M_erase(std::__cxx11::basic_string<_CharT, _Traits, _Alloc>::size_type, std::__cxx11::basic_string<_CharT, _Traits, _Alloc>::size_type)':
1872zoo_service_loader.c:31:28: error: expected primary-expression before ')' token
1873 #define length(x) (sizeof(x) / sizeof(x[0]))
1874                            ^
1875zoo_service_loader.c:31:40: error: lambda-expression in unevaluated context
1876 #define length(x) (sizeof(x) / sizeof(x[0]))
1877                                        ^
1878zoo_service_loader.c:31:41: error: expected identifier before numeric constant
1879 #define length(x) (sizeof(x) / sizeof(x[0]))
1880                                         ^
1881zoo_service_loader.c:31:43: error: expected '{' before ')' token
1882 #define length(x) (sizeof(x) / sizeof(x[0]))
1883                                           ^
1884zoo_service_loader.c:31:43: warning: lambda expressions only available with -std=c++11 or -std=gnu++11
1885zoo_service_loader.c:31:28: error: expected primary-expression before ')' token
1886 #define length(x) (sizeof(x) / sizeof(x[0]))
1887                            ^
1888zoo_service_loader.c:31:40: error: lambda-expression in unevaluated context
1889 #define length(x) (sizeof(x) / sizeof(x[0]))
1890                                        ^
1891zoo_service_loader.c:31:41: error: expected identifier before numeric constant
1892 #define length(x) (sizeof(x) / sizeof(x[0]))
1893                                         ^
1894zoo_service_loader.c:31:43: error: expected '{' before ')' token
1895 #define length(x) (sizeof(x) / sizeof(x[0]))
1896                                           ^
1897zoo_service_loader.c:31:43: warning: lambda expressions only available with -std=c++11 or -std=gnu++11
1898/usr/include/c++/5/bits/basic_string.tcc: In function 'std::__cxx11::basic_string<_CharT, _Traits, _Alloc> std::operator+(const _CharT*, const std::__cxx11::basic_string<_CharT, _Traits, _Alloc>&)':
1899zoo_service_loader.c:31:19: error: expected unqualified-id before '(' token
1900 #define length(x) (sizeof(x) / sizeof(x[0]))
1901                   ^
1902/usr/include/c++/5/bits/basic_string.tcc: In member function 'int std::__cxx11::basic_string<_CharT, _Traits, _Alloc>::compare(const _CharT*) const':
1903zoo_service_loader.c:31:19: error: expected unqualified-id before '(' token
1904 #define length(x) (sizeof(x) / sizeof(x[0]))
1905                   ^
1906/usr/include/c++/5/bits/basic_string.tcc: In member function 'int std::__cxx11::basic_string<_CharT, _Traits, _Alloc>::compare(std::__cxx11::basic_string<_CharT, _Traits, _Alloc>::size_type, std::__cxx11::basic_string<_CharT, _Traits, _Alloc>::size_type, const _CharT*) const':
1907zoo_service_loader.c:31:19: error: expected unqualified-id before '(' token
1908 #define length(x) (sizeof(x) / sizeof(x[0]))
1909                   ^
1910/usr/include/i386-linux-gnu/unicode/stringpiece.h: At global scope:
1911zoo_service_loader.c:31:20: error: expected unqualified-id before 'sizeof'
1912 #define length(x) (sizeof(x) / sizeof(x[0]))
1913                    ^
1914zoo_service_loader.c:31:20: error: expected ')' before 'sizeof'
1915zoo_service_loader.c:31:20: error: expected unqualified-id before 'sizeof'
1916 #define length(x) (sizeof(x) / sizeof(x[0]))
1917                    ^
1918zoo_service_loader.c:31:20: error: expected ')' before 'sizeof'
1919/usr/include/i386-linux-gnu/unicode/unistr.h: In member function 'void icu_55::UnicodeString::pinIndex(int32_t&) const':
1920zoo_service_loader.c:31:28: error: expected primary-expression before ')' token
1921 #define length(x) (sizeof(x) / sizeof(x[0]))
1922                            ^
1923zoo_service_loader.c:31:40: error: lambda-expression in unevaluated context
1924 #define length(x) (sizeof(x) / sizeof(x[0]))
1925                                        ^
1926zoo_service_loader.c:31:41: error: expected identifier before numeric constant
1927 #define length(x) (sizeof(x) / sizeof(x[0]))
1928                                         ^
1929zoo_service_loader.c:31:43: error: expected '{' before ')' token
1930 #define length(x) (sizeof(x) / sizeof(x[0]))
1931                                           ^
1932zoo_service_loader.c:31:43: warning: lambda expressions only available with -std=c++11 or -std=gnu++11
1933zoo_service_loader.c:31:28: error: expected primary-expression before ')' token
1934 #define length(x) (sizeof(x) / sizeof(x[0]))
1935                            ^
1936zoo_service_loader.c:31:40: error: lambda-expression in unevaluated context
1937 #define length(x) (sizeof(x) / sizeof(x[0]))
1938                                        ^
1939zoo_service_loader.c:31:41: error: expected identifier before numeric constant
1940 #define length(x) (sizeof(x) / sizeof(x[0]))
1941                                         ^
1942zoo_service_loader.c:31:43: error: expected '{' before ')' token
1943 #define length(x) (sizeof(x) / sizeof(x[0]))
1944                                           ^
1945zoo_service_loader.c:31:43: warning: lambda expressions only available with -std=c++11 or -std=gnu++11
1946/usr/include/i386-linux-gnu/unicode/unistr.h: In member function 'void icu_55::UnicodeString::pinIndices(int32_t&, int32_t&) const':
1947zoo_service_loader.c:31:28: error: expected primary-expression before ')' token
1948 #define length(x) (sizeof(x) / sizeof(x[0]))
1949                            ^
1950zoo_service_loader.c:31:40: error: lambda-expression in unevaluated context
1951 #define length(x) (sizeof(x) / sizeof(x[0]))
1952                                        ^
1953zoo_service_loader.c:31:41: error: expected identifier before numeric constant
1954 #define length(x) (sizeof(x) / sizeof(x[0]))
1955                                         ^
1956zoo_service_loader.c:31:43: error: expected '{' before ')' token
1957 #define length(x) (sizeof(x) / sizeof(x[0]))
1958                                           ^
1959zoo_service_loader.c:31:43: warning: lambda expressions only available with -std=c++11 or -std=gnu++11
1960/usr/include/i386-linux-gnu/unicode/unistr.h: At global scope:
1961zoo_service_loader.c:31:19: error: expected unqualified-id before '(' token
1962 #define length(x) (sizeof(x) / sizeof(x[0]))
1963                   ^
1964/usr/include/i386-linux-gnu/unicode/unistr.h: In member function 'UBool icu_55::UnicodeString::operator==(const icu_55::UnicodeString&) const':
1965zoo_service_loader.c:31:28: error: expected primary-expression before ')' token
1966 #define length(x) (sizeof(x) / sizeof(x[0]))
1967                            ^
1968zoo_service_loader.c:31:40: error: lambda-expression in unevaluated context
1969 #define length(x) (sizeof(x) / sizeof(x[0]))
1970                                        ^
1971zoo_service_loader.c:31:41: error: expected identifier before numeric constant
1972 #define length(x) (sizeof(x) / sizeof(x[0]))
1973                                         ^
1974zoo_service_loader.c:31:43: error: expected '{' before ')' token
1975 #define length(x) (sizeof(x) / sizeof(x[0]))
1976                                           ^
1977zoo_service_loader.c:31:43: warning: lambda expressions only available with -std=c++11 or -std=gnu++11
1978In file included from /usr/include/i386-linux-gnu/unicode/strenum.h:14:0,
1979                 from /usr/include/i386-linux-gnu/unicode/uenum.h:24,
1980                 from /usr/include/i386-linux-gnu/unicode/ucnv.h:51,
1981                 from /usr/include/libxml2/libxml/encoding.h:31,
1982                 from /usr/include/libxml2/libxml/parser.h:810,
1983                 from /usr/include/libxml2/libxml/globals.h:18,
1984                 from /usr/include/libxml2/libxml/threads.h:35,
1985                 from /usr/include/libxml2/libxml/xmlmemory.h:218,
1986                 from /usr/include/libxml2/libxml/tree.h:1307,
1987                 from zoo_service_loader.c:36:
1988/usr/include/i386-linux-gnu/unicode/unistr.h:3719:38: error: 'textLength' was not declared in this scope
1989     return !text.isBogus() && len == textLength && doEquals(text, len);
1990                                      ^
1991/usr/include/i386-linux-gnu/unicode/unistr.h: In member function 'UBool icu_55::UnicodeString::operator>(const icu_55::UnicodeString&) const':
1992zoo_service_loader.c:31:28: error: expected primary-expression before ')' token
1993 #define length(x) (sizeof(x) / sizeof(x[0]))
1994                            ^
1995zoo_service_loader.c:31:40: error: lambda-expression in unevaluated context
1996 #define length(x) (sizeof(x) / sizeof(x[0]))
1997                                        ^
1998zoo_service_loader.c:31:41: error: expected identifier before numeric constant
1999 #define length(x) (sizeof(x) / sizeof(x[0]))
2000                                         ^
2001zoo_service_loader.c:31:43: error: expected '{' before ')' token
2002 #define length(x) (sizeof(x) / sizeof(x[0]))
2003                                           ^
2004zoo_service_loader.c:31:43: warning: lambda expressions only available with -std=c++11 or -std=gnu++11
2005zoo_service_loader.c:31:19: error: expected unqualified-id before '(' token
2006 #define length(x) (sizeof(x) / sizeof(x[0]))
2007                   ^
2008zoo_service_loader.c:31:28: error: expected primary-expression before ')' token
2009 #define length(x) (sizeof(x) / sizeof(x[0]))
2010                            ^
2011zoo_service_loader.c:31:40: error: lambda-expression in unevaluated context
2012 #define length(x) (sizeof(x) / sizeof(x[0]))
2013                                        ^
2014zoo_service_loader.c:31:41: error: expected identifier before numeric constant
2015 #define length(x) (sizeof(x) / sizeof(x[0]))
2016                                         ^
2017zoo_service_loader.c:31:43: error: expected '{' before ')' token
2018 #define length(x) (sizeof(x) / sizeof(x[0]))
2019                                           ^
2020zoo_service_loader.c:31:43: warning: lambda expressions only available with -std=c++11 or -std=gnu++11
2021/usr/include/i386-linux-gnu/unicode/unistr.h: In member function 'UBool icu_55::UnicodeString::operator<(const icu_55::UnicodeString&) const':
2022zoo_service_loader.c:31:28: error: expected primary-expression before ')' token
2023 #define length(x) (sizeof(x) / sizeof(x[0]))
2024                            ^
2025zoo_service_loader.c:31:40: error: lambda-expression in unevaluated context
2026 #define length(x) (sizeof(x) / sizeof(x[0]))
2027                                        ^
2028zoo_service_loader.c:31:41: error: expected identifier before numeric constant
2029 #define length(x) (sizeof(x) / sizeof(x[0]))
2030                                         ^
2031zoo_service_loader.c:31:43: error: expected '{' before ')' token
2032 #define length(x) (sizeof(x) / sizeof(x[0]))
2033                                           ^
2034zoo_service_loader.c:31:43: warning: lambda expressions only available with -std=c++11 or -std=gnu++11
2035zoo_service_loader.c:31:19: error: expected unqualified-id before '(' token
2036 #define length(x) (sizeof(x) / sizeof(x[0]))
2037                   ^
2038zoo_service_loader.c:31:28: error: expected primary-expression before ')' token
2039 #define length(x) (sizeof(x) / sizeof(x[0]))
2040                            ^
2041zoo_service_loader.c:31:40: error: lambda-expression in unevaluated context
2042 #define length(x) (sizeof(x) / sizeof(x[0]))
2043                                        ^
2044zoo_service_loader.c:31:41: error: expected identifier before numeric constant
2045 #define length(x) (sizeof(x) / sizeof(x[0]))
2046                                         ^
2047zoo_service_loader.c:31:43: error: expected '{' before ')' token
2048 #define length(x) (sizeof(x) / sizeof(x[0]))
2049                                           ^
2050zoo_service_loader.c:31:43: warning: lambda expressions only available with -std=c++11 or -std=gnu++11
2051/usr/include/i386-linux-gnu/unicode/unistr.h: In member function 'UBool icu_55::UnicodeString::operator>=(const icu_55::UnicodeString&) const':
2052zoo_service_loader.c:31:28: error: expected primary-expression before ')' token
2053 #define length(x) (sizeof(x) / sizeof(x[0]))
2054                            ^
2055zoo_service_loader.c:31:40: error: lambda-expression in unevaluated context
2056 #define length(x) (sizeof(x) / sizeof(x[0]))
2057                                        ^
2058zoo_service_loader.c:31:41: error: expected identifier before numeric constant
2059 #define length(x) (sizeof(x) / sizeof(x[0]))
2060                                         ^
2061zoo_service_loader.c:31:43: error: expected '{' before ')' token
2062 #define length(x) (sizeof(x) / sizeof(x[0]))
2063                                           ^
2064zoo_service_loader.c:31:43: warning: lambda expressions only available with -std=c++11 or -std=gnu++11
2065zoo_service_loader.c:31:19: error: expected unqualified-id before '(' token
2066 #define length(x) (sizeof(x) / sizeof(x[0]))
2067                   ^
2068zoo_service_loader.c:31:28: error: expected primary-expression before ')' token
2069 #define length(x) (sizeof(x) / sizeof(x[0]))
2070                            ^
2071zoo_service_loader.c:31:40: error: lambda-expression in unevaluated context
2072 #define length(x) (sizeof(x) / sizeof(x[0]))
2073                                        ^
2074zoo_service_loader.c:31:41: error: expected identifier before numeric constant
2075 #define length(x) (sizeof(x) / sizeof(x[0]))
2076                                         ^
2077zoo_service_loader.c:31:43: error: expected '{' before ')' token
2078 #define length(x) (sizeof(x) / sizeof(x[0]))
2079                                           ^
2080zoo_service_loader.c:31:43: warning: lambda expressions only available with -std=c++11 or -std=gnu++11
2081/usr/include/i386-linux-gnu/unicode/unistr.h: In member function 'UBool icu_55::UnicodeString::operator<=(const icu_55::UnicodeString&) const':
2082zoo_service_loader.c:31:28: error: expected primary-expression before ')' token
2083 #define length(x) (sizeof(x) / sizeof(x[0]))
2084                            ^
2085zoo_service_loader.c:31:40: error: lambda-expression in unevaluated context
2086 #define length(x) (sizeof(x) / sizeof(x[0]))
2087                                        ^
2088zoo_service_loader.c:31:41: error: expected identifier before numeric constant
2089 #define length(x) (sizeof(x) / sizeof(x[0]))
2090                                         ^
2091zoo_service_loader.c:31:43: error: expected '{' before ')' token
2092 #define length(x) (sizeof(x) / sizeof(x[0]))
2093                                           ^
2094zoo_service_loader.c:31:43: warning: lambda expressions only available with -std=c++11 or -std=gnu++11
2095zoo_service_loader.c:31:19: error: expected unqualified-id before '(' token
2096 #define length(x) (sizeof(x) / sizeof(x[0]))
2097                   ^
2098zoo_service_loader.c:31:28: error: expected primary-expression before ')' token
2099 #define length(x) (sizeof(x) / sizeof(x[0]))
2100                            ^
2101zoo_service_loader.c:31:40: error: lambda-expression in unevaluated context
2102 #define length(x) (sizeof(x) / sizeof(x[0]))
2103                                        ^
2104zoo_service_loader.c:31:41: error: expected identifier before numeric constant
2105 #define length(x) (sizeof(x) / sizeof(x[0]))
2106                                         ^
2107zoo_service_loader.c:31:43: error: expected '{' before ')' token
2108 #define length(x) (sizeof(x) / sizeof(x[0]))
2109                                           ^
2110zoo_service_loader.c:31:43: warning: lambda expressions only available with -std=c++11 or -std=gnu++11
2111/usr/include/i386-linux-gnu/unicode/unistr.h: In member function 'int8_t icu_55::UnicodeString::compare(const icu_55::UnicodeString&) const':
2112zoo_service_loader.c:31:28: error: expected primary-expression before ')' token
2113 #define length(x) (sizeof(x) / sizeof(x[0]))
2114                            ^
2115zoo_service_loader.c:31:40: error: lambda-expression in unevaluated context
2116 #define length(x) (sizeof(x) / sizeof(x[0]))
2117                                        ^
2118zoo_service_loader.c:31:41: error: expected identifier before numeric constant
2119 #define length(x) (sizeof(x) / sizeof(x[0]))
2120                                         ^
2121zoo_service_loader.c:31:43: error: expected '{' before ')' token
2122 #define length(x) (sizeof(x) / sizeof(x[0]))
2123                                           ^
2124zoo_service_loader.c:31:43: warning: lambda expressions only available with -std=c++11 or -std=gnu++11
2125zoo_service_loader.c:31:19: error: expected unqualified-id before '(' token
2126 #define length(x) (sizeof(x) / sizeof(x[0]))
2127                   ^
2128zoo_service_loader.c:31:28: error: expected primary-expression before ')' token
2129 #define length(x) (sizeof(x) / sizeof(x[0]))
2130                            ^
2131zoo_service_loader.c:31:40: error: lambda-expression in unevaluated context
2132 #define length(x) (sizeof(x) / sizeof(x[0]))
2133                                        ^
2134zoo_service_loader.c:31:41: error: expected identifier before numeric constant
2135 #define length(x) (sizeof(x) / sizeof(x[0]))
2136                                         ^
2137zoo_service_loader.c:31:43: error: expected '{' before ')' token
2138 #define length(x) (sizeof(x) / sizeof(x[0]))
2139                                           ^
2140zoo_service_loader.c:31:43: warning: lambda expressions only available with -std=c++11 or -std=gnu++11
2141/usr/include/i386-linux-gnu/unicode/unistr.h: In member function 'int8_t icu_55::UnicodeString::compare(int32_t, int32_t, const icu_55::UnicodeString&) const':
2142zoo_service_loader.c:31:19: error: expected unqualified-id before '(' token
2143 #define length(x) (sizeof(x) / sizeof(x[0]))
2144                   ^
2145zoo_service_loader.c:31:28: error: expected primary-expression before ')' token
2146 #define length(x) (sizeof(x) / sizeof(x[0]))
2147                            ^
2148zoo_service_loader.c:31:40: error: lambda-expression in unevaluated context
2149 #define length(x) (sizeof(x) / sizeof(x[0]))
2150                                        ^
2151zoo_service_loader.c:31:41: error: expected identifier before numeric constant
2152 #define length(x) (sizeof(x) / sizeof(x[0]))
2153                                         ^
2154zoo_service_loader.c:31:43: error: expected '{' before ')' token
2155 #define length(x) (sizeof(x) / sizeof(x[0]))
2156                                           ^
2157zoo_service_loader.c:31:43: warning: lambda expressions only available with -std=c++11 or -std=gnu++11
2158/usr/include/i386-linux-gnu/unicode/unistr.h: In member function 'int8_t icu_55::UnicodeString::compare(const UChar*, int32_t) const':
2159zoo_service_loader.c:31:28: error: expected primary-expression before ')' token
2160 #define length(x) (sizeof(x) / sizeof(x[0]))
2161                            ^
2162zoo_service_loader.c:31:40: error: lambda-expression in unevaluated context
2163 #define length(x) (sizeof(x) / sizeof(x[0]))
2164                                        ^
2165zoo_service_loader.c:31:41: error: expected identifier before numeric constant
2166 #define length(x) (sizeof(x) / sizeof(x[0]))
2167                                         ^
2168zoo_service_loader.c:31:43: error: expected '{' before ')' token
2169 #define length(x) (sizeof(x) / sizeof(x[0]))
2170                                           ^
2171zoo_service_loader.c:31:43: warning: lambda expressions only available with -std=c++11 or -std=gnu++11
2172/usr/include/i386-linux-gnu/unicode/unistr.h: In member function 'int8_t icu_55::UnicodeString::compareCodePointOrder(const icu_55::UnicodeString&) const':
2173zoo_service_loader.c:31:28: error: expected primary-expression before ')' token
2174 #define length(x) (sizeof(x) / sizeof(x[0]))
2175                            ^
2176zoo_service_loader.c:31:40: error: lambda-expression in unevaluated context
2177 #define length(x) (sizeof(x) / sizeof(x[0]))
2178                                        ^
2179zoo_service_loader.c:31:41: error: expected identifier before numeric constant
2180 #define length(x) (sizeof(x) / sizeof(x[0]))
2181                                         ^
2182zoo_service_loader.c:31:43: error: expected '{' before ')' token
2183 #define length(x) (sizeof(x) / sizeof(x[0]))
2184                                           ^
2185zoo_service_loader.c:31:43: warning: lambda expressions only available with -std=c++11 or -std=gnu++11
2186zoo_service_loader.c:31:19: error: expected unqualified-id before '(' token
2187 #define length(x) (sizeof(x) / sizeof(x[0]))
2188                   ^
2189zoo_service_loader.c:31:28: error: expected primary-expression before ')' token
2190 #define length(x) (sizeof(x) / sizeof(x[0]))
2191                            ^
2192zoo_service_loader.c:31:40: error: lambda-expression in unevaluated context
2193 #define length(x) (sizeof(x) / sizeof(x[0]))
2194                                        ^
2195zoo_service_loader.c:31:41: error: expected identifier before numeric constant
2196 #define length(x) (sizeof(x) / sizeof(x[0]))
2197                                         ^
2198zoo_service_loader.c:31:43: error: expected '{' before ')' token
2199 #define length(x) (sizeof(x) / sizeof(x[0]))
2200                                           ^
2201zoo_service_loader.c:31:43: warning: lambda expressions only available with -std=c++11 or -std=gnu++11
2202/usr/include/i386-linux-gnu/unicode/unistr.h: In member function 'int8_t icu_55::UnicodeString::compareCodePointOrder(int32_t, int32_t, const icu_55::UnicodeString&) const':
2203zoo_service_loader.c:31:19: error: expected unqualified-id before '(' token
2204 #define length(x) (sizeof(x) / sizeof(x[0]))
2205                   ^
2206zoo_service_loader.c:31:28: error: expected primary-expression before ')' token
2207 #define length(x) (sizeof(x) / sizeof(x[0]))
2208                            ^
2209zoo_service_loader.c:31:40: error: lambda-expression in unevaluated context
2210 #define length(x) (sizeof(x) / sizeof(x[0]))
2211                                        ^
2212zoo_service_loader.c:31:41: error: expected identifier before numeric constant
2213 #define length(x) (sizeof(x) / sizeof(x[0]))
2214                                         ^
2215zoo_service_loader.c:31:43: error: expected '{' before ')' token
2216 #define length(x) (sizeof(x) / sizeof(x[0]))
2217                                           ^
2218zoo_service_loader.c:31:43: warning: lambda expressions only available with -std=c++11 or -std=gnu++11
2219/usr/include/i386-linux-gnu/unicode/unistr.h: In member function 'int8_t icu_55::UnicodeString::compareCodePointOrder(const UChar*, int32_t) const':
2220zoo_service_loader.c:31:28: error: expected primary-expression before ')' token
2221 #define length(x) (sizeof(x) / sizeof(x[0]))
2222                            ^
2223zoo_service_loader.c:31:40: error: lambda-expression in unevaluated context
2224 #define length(x) (sizeof(x) / sizeof(x[0]))
2225                                        ^
2226zoo_service_loader.c:31:41: error: expected identifier before numeric constant
2227 #define length(x) (sizeof(x) / sizeof(x[0]))
2228                                         ^
2229zoo_service_loader.c:31:43: error: expected '{' before ')' token
2230 #define length(x) (sizeof(x) / sizeof(x[0]))
2231                                           ^
2232zoo_service_loader.c:31:43: warning: lambda expressions only available with -std=c++11 or -std=gnu++11
2233/usr/include/i386-linux-gnu/unicode/unistr.h: In member function 'int8_t icu_55::UnicodeString::caseCompare(const icu_55::UnicodeString&, uint32_t) const':
2234zoo_service_loader.c:31:28: error: expected primary-expression before ')' token
2235 #define length(x) (sizeof(x) / sizeof(x[0]))
2236                            ^
2237zoo_service_loader.c:31:40: error: lambda-expression in unevaluated context
2238 #define length(x) (sizeof(x) / sizeof(x[0]))
2239                                        ^
2240zoo_service_loader.c:31:41: error: expected identifier before numeric constant
2241 #define length(x) (sizeof(x) / sizeof(x[0]))
2242                                         ^
2243zoo_service_loader.c:31:43: error: expected '{' before ')' token
2244 #define length(x) (sizeof(x) / sizeof(x[0]))
2245                                           ^
2246zoo_service_loader.c:31:43: warning: lambda expressions only available with -std=c++11 or -std=gnu++11
2247zoo_service_loader.c:31:19: error: expected unqualified-id before '(' token
2248 #define length(x) (sizeof(x) / sizeof(x[0]))
2249                   ^
2250zoo_service_loader.c:31:28: error: expected primary-expression before ')' token
2251 #define length(x) (sizeof(x) / sizeof(x[0]))
2252                            ^
2253zoo_service_loader.c:31:40: error: lambda-expression in unevaluated context
2254 #define length(x) (sizeof(x) / sizeof(x[0]))
2255                                        ^
2256zoo_service_loader.c:31:41: error: expected identifier before numeric constant
2257 #define length(x) (sizeof(x) / sizeof(x[0]))
2258                                         ^
2259zoo_service_loader.c:31:43: error: expected '{' before ')' token
2260 #define length(x) (sizeof(x) / sizeof(x[0]))
2261                                           ^
2262zoo_service_loader.c:31:43: warning: lambda expressions only available with -std=c++11 or -std=gnu++11
2263/usr/include/i386-linux-gnu/unicode/unistr.h: In member function 'int8_t icu_55::UnicodeString::caseCompare(int32_t, int32_t, const icu_55::UnicodeString&, uint32_t) const':
2264zoo_service_loader.c:31:19: error: expected unqualified-id before '(' token
2265 #define length(x) (sizeof(x) / sizeof(x[0]))
2266                   ^
2267zoo_service_loader.c:31:28: error: expected primary-expression before ')' token
2268 #define length(x) (sizeof(x) / sizeof(x[0]))
2269                            ^
2270zoo_service_loader.c:31:40: error: lambda-expression in unevaluated context
2271 #define length(x) (sizeof(x) / sizeof(x[0]))
2272                                        ^
2273zoo_service_loader.c:31:41: error: expected identifier before numeric constant
2274 #define length(x) (sizeof(x) / sizeof(x[0]))
2275                                         ^
2276zoo_service_loader.c:31:43: error: expected '{' before ')' token
2277 #define length(x) (sizeof(x) / sizeof(x[0]))
2278                                           ^
2279zoo_service_loader.c:31:43: warning: lambda expressions only available with -std=c++11 or -std=gnu++11
2280/usr/include/i386-linux-gnu/unicode/unistr.h: In member function 'int8_t icu_55::UnicodeString::caseCompare(const UChar*, int32_t, uint32_t) const':
2281zoo_service_loader.c:31:28: error: expected primary-expression before ')' token
2282 #define length(x) (sizeof(x) / sizeof(x[0]))
2283                            ^
2284zoo_service_loader.c:31:40: error: lambda-expression in unevaluated context
2285 #define length(x) (sizeof(x) / sizeof(x[0]))
2286                                        ^
2287zoo_service_loader.c:31:41: error: expected identifier before numeric constant
2288 #define length(x) (sizeof(x) / sizeof(x[0]))
2289                                         ^
2290zoo_service_loader.c:31:43: error: expected '{' before ')' token
2291 #define length(x) (sizeof(x) / sizeof(x[0]))
2292                                           ^
2293zoo_service_loader.c:31:43: warning: lambda expressions only available with -std=c++11 or -std=gnu++11
2294/usr/include/i386-linux-gnu/unicode/unistr.h: In member function 'int32_t icu_55::UnicodeString::indexOf(const icu_55::UnicodeString&) const':
2295zoo_service_loader.c:31:19: error: expected unqualified-id before '(' token
2296 #define length(x) (sizeof(x) / sizeof(x[0]))
2297                   ^
2298zoo_service_loader.c:31:28: error: expected primary-expression before ')' token
2299 #define length(x) (sizeof(x) / sizeof(x[0]))
2300                            ^
2301zoo_service_loader.c:31:40: error: lambda-expression in unevaluated context
2302 #define length(x) (sizeof(x) / sizeof(x[0]))
2303                                        ^
2304zoo_service_loader.c:31:41: error: expected identifier before numeric constant
2305 #define length(x) (sizeof(x) / sizeof(x[0]))
2306                                         ^
2307zoo_service_loader.c:31:43: error: expected '{' before ')' token
2308 #define length(x) (sizeof(x) / sizeof(x[0]))
2309                                           ^
2310zoo_service_loader.c:31:43: warning: lambda expressions only available with -std=c++11 or -std=gnu++11
2311zoo_service_loader.c:31:28: error: expected primary-expression before ')' token
2312 #define length(x) (sizeof(x) / sizeof(x[0]))
2313                            ^
2314zoo_service_loader.c:31:40: error: lambda-expression in unevaluated context
2315 #define length(x) (sizeof(x) / sizeof(x[0]))
2316                                        ^
2317zoo_service_loader.c:31:41: error: expected identifier before numeric constant
2318 #define length(x) (sizeof(x) / sizeof(x[0]))
2319                                         ^
2320zoo_service_loader.c:31:43: error: expected '{' before ')' token
2321 #define length(x) (sizeof(x) / sizeof(x[0]))
2322                                           ^
2323zoo_service_loader.c:31:43: warning: lambda expressions only available with -std=c++11 or -std=gnu++11
2324/usr/include/i386-linux-gnu/unicode/unistr.h: In member function 'int32_t icu_55::UnicodeString::indexOf(const icu_55::UnicodeString&, int32_t) const':
2325zoo_service_loader.c:31:19: error: expected unqualified-id before '(' token
2326 #define length(x) (sizeof(x) / sizeof(x[0]))
2327                   ^
2328zoo_service_loader.c:31:28: error: expected primary-expression before ')' token
2329 #define length(x) (sizeof(x) / sizeof(x[0]))
2330                            ^
2331zoo_service_loader.c:31:40: error: lambda-expression in unevaluated context
2332 #define length(x) (sizeof(x) / sizeof(x[0]))
2333                                        ^
2334zoo_service_loader.c:31:41: error: expected identifier before numeric constant
2335 #define length(x) (sizeof(x) / sizeof(x[0]))
2336                                         ^
2337zoo_service_loader.c:31:43: error: expected '{' before ')' token
2338 #define length(x) (sizeof(x) / sizeof(x[0]))
2339                                           ^
2340zoo_service_loader.c:31:43: warning: lambda expressions only available with -std=c++11 or -std=gnu++11
2341zoo_service_loader.c:31:28: error: expected primary-expression before ')' token
2342 #define length(x) (sizeof(x) / sizeof(x[0]))
2343                            ^
2344zoo_service_loader.c:31:40: error: lambda-expression in unevaluated context
2345 #define length(x) (sizeof(x) / sizeof(x[0]))
2346                                        ^
2347zoo_service_loader.c:31:41: error: expected identifier before numeric constant
2348 #define length(x) (sizeof(x) / sizeof(x[0]))
2349                                         ^
2350zoo_service_loader.c:31:43: error: expected '{' before ')' token
2351 #define length(x) (sizeof(x) / sizeof(x[0]))
2352                                           ^
2353zoo_service_loader.c:31:43: warning: lambda expressions only available with -std=c++11 or -std=gnu++11
2354/usr/include/i386-linux-gnu/unicode/unistr.h: In member function 'int32_t icu_55::UnicodeString::indexOf(const icu_55::UnicodeString&, int32_t, int32_t) const':
2355zoo_service_loader.c:31:19: error: expected unqualified-id before '(' token
2356 #define length(x) (sizeof(x) / sizeof(x[0]))
2357                   ^
2358zoo_service_loader.c:31:28: error: expected primary-expression before ')' token
2359 #define length(x) (sizeof(x) / sizeof(x[0]))
2360                            ^
2361zoo_service_loader.c:31:40: error: lambda-expression in unevaluated context
2362 #define length(x) (sizeof(x) / sizeof(x[0]))
2363                                        ^
2364zoo_service_loader.c:31:41: error: expected identifier before numeric constant
2365 #define length(x) (sizeof(x) / sizeof(x[0]))
2366                                         ^
2367zoo_service_loader.c:31:43: error: expected '{' before ')' token
2368 #define length(x) (sizeof(x) / sizeof(x[0]))
2369                                           ^
2370zoo_service_loader.c:31:43: warning: lambda expressions only available with -std=c++11 or -std=gnu++11
2371/usr/include/i386-linux-gnu/unicode/unistr.h: In member function 'int32_t icu_55::UnicodeString::indexOf(const UChar*, int32_t, int32_t) const':
2372zoo_service_loader.c:31:28: error: expected primary-expression before ')' token
2373 #define length(x) (sizeof(x) / sizeof(x[0]))
2374                            ^
2375zoo_service_loader.c:31:40: error: lambda-expression in unevaluated context
2376 #define length(x) (sizeof(x) / sizeof(x[0]))
2377                                        ^
2378zoo_service_loader.c:31:41: error: expected identifier before numeric constant
2379 #define length(x) (sizeof(x) / sizeof(x[0]))
2380                                         ^
2381zoo_service_loader.c:31:43: error: expected '{' before ')' token
2382 #define length(x) (sizeof(x) / sizeof(x[0]))
2383                                           ^
2384zoo_service_loader.c:31:43: warning: lambda expressions only available with -std=c++11 or -std=gnu++11
2385/usr/include/i386-linux-gnu/unicode/unistr.h: In member function 'int32_t icu_55::UnicodeString::indexOf(UChar) const':
2386zoo_service_loader.c:31:28: error: expected primary-expression before ')' token
2387 #define length(x) (sizeof(x) / sizeof(x[0]))
2388                            ^
2389zoo_service_loader.c:31:40: error: lambda-expression in unevaluated context
2390 #define length(x) (sizeof(x) / sizeof(x[0]))
2391                                        ^
2392zoo_service_loader.c:31:41: error: expected identifier before numeric constant
2393 #define length(x) (sizeof(x) / sizeof(x[0]))
2394                                         ^
2395zoo_service_loader.c:31:43: error: expected '{' before ')' token
2396 #define length(x) (sizeof(x) / sizeof(x[0]))
2397                                           ^
2398zoo_service_loader.c:31:43: warning: lambda expressions only available with -std=c++11 or -std=gnu++11
2399/usr/include/i386-linux-gnu/unicode/unistr.h: In member function 'int32_t icu_55::UnicodeString::indexOf(UChar32) const':
2400zoo_service_loader.c:31:28: error: expected primary-expression before ')' token
2401 #define length(x) (sizeof(x) / sizeof(x[0]))
2402                            ^
2403zoo_service_loader.c:31:40: error: lambda-expression in unevaluated context
2404 #define length(x) (sizeof(x) / sizeof(x[0]))
2405                                        ^
2406zoo_service_loader.c:31:41: error: expected identifier before numeric constant
2407 #define length(x) (sizeof(x) / sizeof(x[0]))
2408                                         ^
2409zoo_service_loader.c:31:43: error: expected '{' before ')' token
2410 #define length(x) (sizeof(x) / sizeof(x[0]))
2411                                           ^
2412zoo_service_loader.c:31:43: warning: lambda expressions only available with -std=c++11 or -std=gnu++11
2413/usr/include/i386-linux-gnu/unicode/unistr.h: In member function 'int32_t icu_55::UnicodeString::indexOf(UChar, int32_t) const':
2414zoo_service_loader.c:31:28: error: expected primary-expression before ')' token
2415 #define length(x) (sizeof(x) / sizeof(x[0]))
2416                            ^
2417zoo_service_loader.c:31:40: error: lambda-expression in unevaluated context
2418 #define length(x) (sizeof(x) / sizeof(x[0]))
2419                                        ^
2420zoo_service_loader.c:31:41: error: expected identifier before numeric constant
2421 #define length(x) (sizeof(x) / sizeof(x[0]))
2422                                         ^
2423zoo_service_loader.c:31:43: error: expected '{' before ')' token
2424 #define length(x) (sizeof(x) / sizeof(x[0]))
2425                                           ^
2426zoo_service_loader.c:31:43: warning: lambda expressions only available with -std=c++11 or -std=gnu++11
2427/usr/include/i386-linux-gnu/unicode/unistr.h: In member function 'int32_t icu_55::UnicodeString::indexOf(UChar32, int32_t) const':
2428zoo_service_loader.c:31:28: error: expected primary-expression before ')' token
2429 #define length(x) (sizeof(x) / sizeof(x[0]))
2430                            ^
2431zoo_service_loader.c:31:40: error: lambda-expression in unevaluated context
2432 #define length(x) (sizeof(x) / sizeof(x[0]))
2433                                        ^
2434zoo_service_loader.c:31:41: error: expected identifier before numeric constant
2435 #define length(x) (sizeof(x) / sizeof(x[0]))
2436                                         ^
2437zoo_service_loader.c:31:43: error: expected '{' before ')' token
2438 #define length(x) (sizeof(x) / sizeof(x[0]))
2439                                           ^
2440zoo_service_loader.c:31:43: warning: lambda expressions only available with -std=c++11 or -std=gnu++11
2441/usr/include/i386-linux-gnu/unicode/unistr.h: In member function 'int32_t icu_55::UnicodeString::lastIndexOf(const UChar*, int32_t, int32_t) const':
2442zoo_service_loader.c:31:28: error: expected primary-expression before ')' token
2443 #define length(x) (sizeof(x) / sizeof(x[0]))
2444                            ^
2445zoo_service_loader.c:31:40: error: lambda-expression in unevaluated context
2446 #define length(x) (sizeof(x) / sizeof(x[0]))
2447                                        ^
2448zoo_service_loader.c:31:41: error: expected identifier before numeric constant
2449 #define length(x) (sizeof(x) / sizeof(x[0]))
2450                                         ^
2451zoo_service_loader.c:31:43: error: expected '{' before ')' token
2452 #define length(x) (sizeof(x) / sizeof(x[0]))
2453                                           ^
2454zoo_service_loader.c:31:43: warning: lambda expressions only available with -std=c++11 or -std=gnu++11
2455/usr/include/i386-linux-gnu/unicode/unistr.h: In member function 'int32_t icu_55::UnicodeString::lastIndexOf(const icu_55::UnicodeString&, int32_t, int32_t) const':
2456zoo_service_loader.c:31:19: error: expected unqualified-id before '(' token
2457 #define length(x) (sizeof(x) / sizeof(x[0]))
2458                   ^
2459zoo_service_loader.c:31:28: error: expected primary-expression before ')' token
2460 #define length(x) (sizeof(x) / sizeof(x[0]))
2461                            ^
2462zoo_service_loader.c:31:40: error: lambda-expression in unevaluated context
2463 #define length(x) (sizeof(x) / sizeof(x[0]))
2464                                        ^
2465zoo_service_loader.c:31:41: error: expected identifier before numeric constant
2466 #define length(x) (sizeof(x) / sizeof(x[0]))
2467                                         ^
2468zoo_service_loader.c:31:43: error: expected '{' before ')' token
2469 #define length(x) (sizeof(x) / sizeof(x[0]))
2470                                           ^
2471zoo_service_loader.c:31:43: warning: lambda expressions only available with -std=c++11 or -std=gnu++11
2472/usr/include/i386-linux-gnu/unicode/unistr.h: In member function 'int32_t icu_55::UnicodeString::lastIndexOf(const icu_55::UnicodeString&, int32_t) const':
2473zoo_service_loader.c:31:19: error: expected unqualified-id before '(' token
2474 #define length(x) (sizeof(x) / sizeof(x[0]))
2475                   ^
2476zoo_service_loader.c:31:28: error: expected primary-expression before ')' token
2477 #define length(x) (sizeof(x) / sizeof(x[0]))
2478                            ^
2479zoo_service_loader.c:31:40: error: lambda-expression in unevaluated context
2480 #define length(x) (sizeof(x) / sizeof(x[0]))
2481                                        ^
2482zoo_service_loader.c:31:41: error: expected identifier before numeric constant
2483 #define length(x) (sizeof(x) / sizeof(x[0]))
2484                                         ^
2485zoo_service_loader.c:31:43: error: expected '{' before ')' token
2486 #define length(x) (sizeof(x) / sizeof(x[0]))
2487                                           ^
2488zoo_service_loader.c:31:43: warning: lambda expressions only available with -std=c++11 or -std=gnu++11
2489zoo_service_loader.c:31:28: error: expected primary-expression before ')' token
2490 #define length(x) (sizeof(x) / sizeof(x[0]))
2491                            ^
2492zoo_service_loader.c:31:40: error: lambda-expression in unevaluated context
2493 #define length(x) (sizeof(x) / sizeof(x[0]))
2494                                        ^
2495zoo_service_loader.c:31:41: error: expected identifier before numeric constant
2496 #define length(x) (sizeof(x) / sizeof(x[0]))
2497                                         ^
2498zoo_service_loader.c:31:43: error: expected '{' before ')' token
2499 #define length(x) (sizeof(x) / sizeof(x[0]))
2500                                           ^
2501zoo_service_loader.c:31:43: warning: lambda expressions only available with -std=c++11 or -std=gnu++11
2502/usr/include/i386-linux-gnu/unicode/unistr.h: In member function 'int32_t icu_55::UnicodeString::lastIndexOf(const icu_55::UnicodeString&) const':
2503zoo_service_loader.c:31:19: error: expected unqualified-id before '(' token
2504 #define length(x) (sizeof(x) / sizeof(x[0]))
2505                   ^
2506zoo_service_loader.c:31:28: error: expected primary-expression before ')' token
2507 #define length(x) (sizeof(x) / sizeof(x[0]))
2508                            ^
2509zoo_service_loader.c:31:40: error: lambda-expression in unevaluated context
2510 #define length(x) (sizeof(x) / sizeof(x[0]))
2511                                        ^
2512zoo_service_loader.c:31:41: error: expected identifier before numeric constant
2513 #define length(x) (sizeof(x) / sizeof(x[0]))
2514                                         ^
2515zoo_service_loader.c:31:43: error: expected '{' before ')' token
2516 #define length(x) (sizeof(x) / sizeof(x[0]))
2517                                           ^
2518zoo_service_loader.c:31:43: warning: lambda expressions only available with -std=c++11 or -std=gnu++11
2519zoo_service_loader.c:31:28: error: expected primary-expression before ')' token
2520 #define length(x) (sizeof(x) / sizeof(x[0]))
2521                            ^
2522zoo_service_loader.c:31:40: error: lambda-expression in unevaluated context
2523 #define length(x) (sizeof(x) / sizeof(x[0]))
2524                                        ^
2525zoo_service_loader.c:31:41: error: expected identifier before numeric constant
2526 #define length(x) (sizeof(x) / sizeof(x[0]))
2527                                         ^
2528zoo_service_loader.c:31:43: error: expected '{' before ')' token
2529 #define length(x) (sizeof(x) / sizeof(x[0]))
2530                                           ^
2531zoo_service_loader.c:31:43: warning: lambda expressions only available with -std=c++11 or -std=gnu++11
2532/usr/include/i386-linux-gnu/unicode/unistr.h: In member function 'int32_t icu_55::UnicodeString::lastIndexOf(UChar) const':
2533zoo_service_loader.c:31:28: error: expected primary-expression before ')' token
2534 #define length(x) (sizeof(x) / sizeof(x[0]))
2535                            ^
2536zoo_service_loader.c:31:40: error: lambda-expression in unevaluated context
2537 #define length(x) (sizeof(x) / sizeof(x[0]))
2538                                        ^
2539zoo_service_loader.c:31:41: error: expected identifier before numeric constant
2540 #define length(x) (sizeof(x) / sizeof(x[0]))
2541                                         ^
2542zoo_service_loader.c:31:43: error: expected '{' before ')' token
2543 #define length(x) (sizeof(x) / sizeof(x[0]))
2544                                           ^
2545zoo_service_loader.c:31:43: warning: lambda expressions only available with -std=c++11 or -std=gnu++11
2546/usr/include/i386-linux-gnu/unicode/unistr.h: In member function 'int32_t icu_55::UnicodeString::lastIndexOf(UChar32) const':
2547zoo_service_loader.c:31:28: error: expected primary-expression before ')' token
2548 #define length(x) (sizeof(x) / sizeof(x[0]))
2549                            ^
2550zoo_service_loader.c:31:40: error: lambda-expression in unevaluated context
2551 #define length(x) (sizeof(x) / sizeof(x[0]))
2552                                        ^
2553zoo_service_loader.c:31:41: error: expected identifier before numeric constant
2554 #define length(x) (sizeof(x) / sizeof(x[0]))
2555                                         ^
2556zoo_service_loader.c:31:43: error: expected '{' before ')' token
2557 #define length(x) (sizeof(x) / sizeof(x[0]))
2558                                           ^
2559zoo_service_loader.c:31:43: warning: lambda expressions only available with -std=c++11 or -std=gnu++11
2560/usr/include/i386-linux-gnu/unicode/unistr.h: In member function 'int32_t icu_55::UnicodeString::lastIndexOf(UChar, int32_t) const':
2561zoo_service_loader.c:31:28: error: expected primary-expression before ')' token
2562 #define length(x) (sizeof(x) / sizeof(x[0]))
2563                            ^
2564zoo_service_loader.c:31:40: error: lambda-expression in unevaluated context
2565 #define length(x) (sizeof(x) / sizeof(x[0]))
2566                                        ^
2567zoo_service_loader.c:31:41: error: expected identifier before numeric constant
2568 #define length(x) (sizeof(x) / sizeof(x[0]))
2569                                         ^
2570zoo_service_loader.c:31:43: error: expected '{' before ')' token
2571 #define length(x) (sizeof(x) / sizeof(x[0]))
2572                                           ^
2573zoo_service_loader.c:31:43: warning: lambda expressions only available with -std=c++11 or -std=gnu++11
2574/usr/include/i386-linux-gnu/unicode/unistr.h: In member function 'int32_t icu_55::UnicodeString::lastIndexOf(UChar32, int32_t) const':
2575zoo_service_loader.c:31:28: error: expected primary-expression before ')' token
2576 #define length(x) (sizeof(x) / sizeof(x[0]))
2577                            ^
2578zoo_service_loader.c:31:40: error: lambda-expression in unevaluated context
2579 #define length(x) (sizeof(x) / sizeof(x[0]))
2580                                        ^
2581zoo_service_loader.c:31:41: error: expected identifier before numeric constant
2582 #define length(x) (sizeof(x) / sizeof(x[0]))
2583                                         ^
2584zoo_service_loader.c:31:43: error: expected '{' before ')' token
2585 #define length(x) (sizeof(x) / sizeof(x[0]))
2586                                           ^
2587zoo_service_loader.c:31:43: warning: lambda expressions only available with -std=c++11 or -std=gnu++11
2588/usr/include/i386-linux-gnu/unicode/unistr.h: In member function 'UBool icu_55::UnicodeString::startsWith(const icu_55::UnicodeString&) const':
2589zoo_service_loader.c:31:19: error: expected unqualified-id before '(' token
2590 #define length(x) (sizeof(x) / sizeof(x[0]))
2591                   ^
2592zoo_service_loader.c:31:28: error: expected primary-expression before ')' token
2593 #define length(x) (sizeof(x) / sizeof(x[0]))
2594                            ^
2595zoo_service_loader.c:31:40: error: lambda-expression in unevaluated context
2596 #define length(x) (sizeof(x) / sizeof(x[0]))
2597                                        ^
2598zoo_service_loader.c:31:41: error: expected identifier before numeric constant
2599 #define length(x) (sizeof(x) / sizeof(x[0]))
2600                                         ^
2601zoo_service_loader.c:31:43: error: expected '{' before ')' token
2602 #define length(x) (sizeof(x) / sizeof(x[0]))
2603                                           ^
2604zoo_service_loader.c:31:43: warning: lambda expressions only available with -std=c++11 or -std=gnu++11
2605zoo_service_loader.c:31:19: error: expected unqualified-id before '(' token
2606 #define length(x) (sizeof(x) / sizeof(x[0]))
2607                   ^
2608zoo_service_loader.c:31:28: error: expected primary-expression before ')' token
2609 #define length(x) (sizeof(x) / sizeof(x[0]))
2610                            ^
2611zoo_service_loader.c:31:40: error: lambda-expression in unevaluated context
2612 #define length(x) (sizeof(x) / sizeof(x[0]))
2613                                        ^
2614zoo_service_loader.c:31:41: error: expected identifier before numeric constant
2615 #define length(x) (sizeof(x) / sizeof(x[0]))
2616                                         ^
2617zoo_service_loader.c:31:43: error: expected '{' before ')' token
2618 #define length(x) (sizeof(x) / sizeof(x[0]))
2619                                           ^
2620zoo_service_loader.c:31:43: warning: lambda expressions only available with -std=c++11 or -std=gnu++11
2621/usr/include/i386-linux-gnu/unicode/unistr.h: In member function 'UBool icu_55::UnicodeString::endsWith(const icu_55::UnicodeString&) const':
2622zoo_service_loader.c:31:28: error: expected primary-expression before ')' token
2623 #define length(x) (sizeof(x) / sizeof(x[0]))
2624                            ^
2625zoo_service_loader.c:31:40: error: lambda-expression in unevaluated context
2626 #define length(x) (sizeof(x) / sizeof(x[0]))
2627                                        ^
2628zoo_service_loader.c:31:41: error: expected identifier before numeric constant
2629 #define length(x) (sizeof(x) / sizeof(x[0]))
2630                                         ^
2631zoo_service_loader.c:31:43: error: expected '{' before ')' token
2632 #define length(x) (sizeof(x) / sizeof(x[0]))
2633                                           ^
2634zoo_service_loader.c:31:43: warning: lambda expressions only available with -std=c++11 or -std=gnu++11
2635zoo_service_loader.c:31:19: error: expected unqualified-id before '(' token
2636 #define length(x) (sizeof(x) / sizeof(x[0]))
2637                   ^
2638zoo_service_loader.c:31:28: error: expected primary-expression before ')' token
2639 #define length(x) (sizeof(x) / sizeof(x[0]))
2640                            ^
2641zoo_service_loader.c:31:40: error: lambda-expression in unevaluated context
2642 #define length(x) (sizeof(x) / sizeof(x[0]))
2643                                        ^
2644zoo_service_loader.c:31:41: error: expected identifier before numeric constant
2645 #define length(x) (sizeof(x) / sizeof(x[0]))
2646                                         ^
2647zoo_service_loader.c:31:43: error: expected '{' before ')' token
2648 #define length(x) (sizeof(x) / sizeof(x[0]))
2649                                           ^
2650zoo_service_loader.c:31:43: warning: lambda expressions only available with -std=c++11 or -std=gnu++11
2651zoo_service_loader.c:31:19: error: expected unqualified-id before '(' token
2652 #define length(x) (sizeof(x) / sizeof(x[0]))
2653                   ^
2654zoo_service_loader.c:31:28: error: expected primary-expression before ')' token
2655 #define length(x) (sizeof(x) / sizeof(x[0]))
2656                            ^
2657zoo_service_loader.c:31:40: error: lambda-expression in unevaluated context
2658 #define length(x) (sizeof(x) / sizeof(x[0]))
2659                                        ^
2660zoo_service_loader.c:31:41: error: expected identifier before numeric constant
2661 #define length(x) (sizeof(x) / sizeof(x[0]))
2662                                         ^
2663zoo_service_loader.c:31:43: error: expected '{' before ')' token
2664 #define length(x) (sizeof(x) / sizeof(x[0]))
2665                                           ^
2666zoo_service_loader.c:31:43: warning: lambda expressions only available with -std=c++11 or -std=gnu++11
2667zoo_service_loader.c:31:19: error: expected unqualified-id before '(' token
2668 #define length(x) (sizeof(x) / sizeof(x[0]))
2669                   ^
2670zoo_service_loader.c:31:28: error: expected primary-expression before ')' token
2671 #define length(x) (sizeof(x) / sizeof(x[0]))
2672                            ^
2673zoo_service_loader.c:31:40: error: lambda-expression in unevaluated context
2674 #define length(x) (sizeof(x) / sizeof(x[0]))
2675                                        ^
2676zoo_service_loader.c:31:41: error: expected identifier before numeric constant
2677 #define length(x) (sizeof(x) / sizeof(x[0]))
2678                                         ^
2679zoo_service_loader.c:31:43: error: expected '{' before ')' token
2680 #define length(x) (sizeof(x) / sizeof(x[0]))
2681                                           ^
2682zoo_service_loader.c:31:43: warning: lambda expressions only available with -std=c++11 or -std=gnu++11
2683/usr/include/i386-linux-gnu/unicode/unistr.h: In member function 'UBool icu_55::UnicodeString::endsWith(const icu_55::UnicodeString&, int32_t, int32_t) const':
2684zoo_service_loader.c:31:28: error: expected primary-expression before ')' token
2685 #define length(x) (sizeof(x) / sizeof(x[0]))
2686                            ^
2687zoo_service_loader.c:31:40: error: lambda-expression in unevaluated context
2688 #define length(x) (sizeof(x) / sizeof(x[0]))
2689                                        ^
2690zoo_service_loader.c:31:41: error: expected identifier before numeric constant
2691 #define length(x) (sizeof(x) / sizeof(x[0]))
2692                                         ^
2693zoo_service_loader.c:31:43: error: expected '{' before ')' token
2694 #define length(x) (sizeof(x) / sizeof(x[0]))
2695                                           ^
2696zoo_service_loader.c:31:43: warning: lambda expressions only available with -std=c++11 or -std=gnu++11
2697/usr/include/i386-linux-gnu/unicode/unistr.h: In member function 'UBool icu_55::UnicodeString::endsWith(const UChar*, int32_t) const':
2698zoo_service_loader.c:31:28: error: expected primary-expression before ')' token
2699 #define length(x) (sizeof(x) / sizeof(x[0]))
2700                            ^
2701zoo_service_loader.c:31:40: error: lambda-expression in unevaluated context
2702 #define length(x) (sizeof(x) / sizeof(x[0]))
2703                                        ^
2704zoo_service_loader.c:31:41: error: expected identifier before numeric constant
2705 #define length(x) (sizeof(x) / sizeof(x[0]))
2706                                         ^
2707zoo_service_loader.c:31:43: error: expected '{' before ')' token
2708 #define length(x) (sizeof(x) / sizeof(x[0]))
2709                                           ^
2710zoo_service_loader.c:31:43: warning: lambda expressions only available with -std=c++11 or -std=gnu++11
2711/usr/include/i386-linux-gnu/unicode/unistr.h: In member function 'UBool icu_55::UnicodeString::endsWith(const UChar*, int32_t, int32_t) const':
2712zoo_service_loader.c:31:28: error: expected primary-expression before ')' token
2713 #define length(x) (sizeof(x) / sizeof(x[0]))
2714                            ^
2715zoo_service_loader.c:31:40: error: lambda-expression in unevaluated context
2716 #define length(x) (sizeof(x) / sizeof(x[0]))
2717                                        ^
2718zoo_service_loader.c:31:41: error: expected identifier before numeric constant
2719 #define length(x) (sizeof(x) / sizeof(x[0]))
2720                                         ^
2721zoo_service_loader.c:31:43: error: expected '{' before ')' token
2722 #define length(x) (sizeof(x) / sizeof(x[0]))
2723                                           ^
2724zoo_service_loader.c:31:43: warning: lambda expressions only available with -std=c++11 or -std=gnu++11
2725/usr/include/i386-linux-gnu/unicode/unistr.h: In member function 'icu_55::UnicodeString& icu_55::UnicodeString::replace(int32_t, int32_t, const icu_55::UnicodeString&)':
2726zoo_service_loader.c:31:19: error: expected unqualified-id before '(' token
2727 #define length(x) (sizeof(x) / sizeof(x[0]))
2728                   ^
2729zoo_service_loader.c:31:28: error: expected primary-expression before ')' token
2730 #define length(x) (sizeof(x) / sizeof(x[0]))
2731                            ^
2732zoo_service_loader.c:31:40: error: lambda-expression in unevaluated context
2733 #define length(x) (sizeof(x) / sizeof(x[0]))
2734                                        ^
2735zoo_service_loader.c:31:41: error: expected identifier before numeric constant
2736 #define length(x) (sizeof(x) / sizeof(x[0]))
2737                                         ^
2738zoo_service_loader.c:31:43: error: expected '{' before ')' token
2739 #define length(x) (sizeof(x) / sizeof(x[0]))
2740                                           ^
2741zoo_service_loader.c:31:43: warning: lambda expressions only available with -std=c++11 or -std=gnu++11
2742/usr/include/i386-linux-gnu/unicode/unistr.h: In member function 'icu_55::UnicodeString& icu_55::UnicodeString::replaceBetween(int32_t, int32_t, const icu_55::UnicodeString&)':
2743zoo_service_loader.c:31:19: error: expected unqualified-id before '(' token
2744 #define length(x) (sizeof(x) / sizeof(x[0]))
2745                   ^
2746zoo_service_loader.c:31:28: error: expected primary-expression before ')' token
2747 #define length(x) (sizeof(x) / sizeof(x[0]))
2748                            ^
2749zoo_service_loader.c:31:40: error: lambda-expression in unevaluated context
2750 #define length(x) (sizeof(x) / sizeof(x[0]))
2751                                        ^
2752zoo_service_loader.c:31:41: error: expected identifier before numeric constant
2753 #define length(x) (sizeof(x) / sizeof(x[0]))
2754                                         ^
2755zoo_service_loader.c:31:43: error: expected '{' before ')' token
2756 #define length(x) (sizeof(x) / sizeof(x[0]))
2757                                           ^
2758zoo_service_loader.c:31:43: warning: lambda expressions only available with -std=c++11 or -std=gnu++11
2759/usr/include/i386-linux-gnu/unicode/unistr.h: In member function 'icu_55::UnicodeString& icu_55::UnicodeString::findAndReplace(const icu_55::UnicodeString&, const icu_55::UnicodeString&)':
2760zoo_service_loader.c:31:28: error: expected primary-expression before ')' token
2761 #define length(x) (sizeof(x) / sizeof(x[0]))
2762                            ^
2763zoo_service_loader.c:31:40: error: lambda-expression in unevaluated context
2764 #define length(x) (sizeof(x) / sizeof(x[0]))
2765                                        ^
2766zoo_service_loader.c:31:41: error: expected identifier before numeric constant
2767 #define length(x) (sizeof(x) / sizeof(x[0]))
2768                                         ^
2769zoo_service_loader.c:31:43: error: expected '{' before ')' token
2770 #define length(x) (sizeof(x) / sizeof(x[0]))
2771                                           ^
2772zoo_service_loader.c:31:43: warning: lambda expressions only available with -std=c++11 or -std=gnu++11
2773zoo_service_loader.c:31:19: error: expected unqualified-id before '(' token
2774 #define length(x) (sizeof(x) / sizeof(x[0]))
2775                   ^
2776zoo_service_loader.c:31:28: error: expected primary-expression before ')' token
2777 #define length(x) (sizeof(x) / sizeof(x[0]))
2778                            ^
2779zoo_service_loader.c:31:40: error: lambda-expression in unevaluated context
2780 #define length(x) (sizeof(x) / sizeof(x[0]))
2781                                        ^
2782zoo_service_loader.c:31:41: error: expected identifier before numeric constant
2783 #define length(x) (sizeof(x) / sizeof(x[0]))
2784                                         ^
2785zoo_service_loader.c:31:43: error: expected '{' before ')' token
2786 #define length(x) (sizeof(x) / sizeof(x[0]))
2787                                           ^
2788zoo_service_loader.c:31:43: warning: lambda expressions only available with -std=c++11 or -std=gnu++11
2789zoo_service_loader.c:31:19: error: expected unqualified-id before '(' token
2790 #define length(x) (sizeof(x) / sizeof(x[0]))
2791                   ^
2792zoo_service_loader.c:31:28: error: expected primary-expression before ')' token
2793 #define length(x) (sizeof(x) / sizeof(x[0]))
2794                            ^
2795zoo_service_loader.c:31:40: error: lambda-expression in unevaluated context
2796 #define length(x) (sizeof(x) / sizeof(x[0]))
2797                                        ^
2798zoo_service_loader.c:31:41: error: expected identifier before numeric constant
2799 #define length(x) (sizeof(x) / sizeof(x[0]))
2800                                         ^
2801zoo_service_loader.c:31:43: error: expected '{' before ')' token
2802 #define length(x) (sizeof(x) / sizeof(x[0]))
2803                                           ^
2804zoo_service_loader.c:31:43: warning: lambda expressions only available with -std=c++11 or -std=gnu++11
2805/usr/include/i386-linux-gnu/unicode/unistr.h: In member function 'icu_55::UnicodeString& icu_55::UnicodeString::findAndReplace(int32_t, int32_t, const icu_55::UnicodeString&, const icu_55::UnicodeString&)':
2806zoo_service_loader.c:31:19: error: expected unqualified-id before '(' token
2807 #define length(x) (sizeof(x) / sizeof(x[0]))
2808                   ^
2809zoo_service_loader.c:31:28: error: expected primary-expression before ')' token
2810 #define length(x) (sizeof(x) / sizeof(x[0]))
2811                            ^
2812zoo_service_loader.c:31:40: error: lambda-expression in unevaluated context
2813 #define length(x) (sizeof(x) / sizeof(x[0]))
2814                                        ^
2815zoo_service_loader.c:31:41: error: expected identifier before numeric constant
2816 #define length(x) (sizeof(x) / sizeof(x[0]))
2817                                         ^
2818zoo_service_loader.c:31:43: error: expected '{' before ')' token
2819 #define length(x) (sizeof(x) / sizeof(x[0]))
2820                                           ^
2821zoo_service_loader.c:31:43: warning: lambda expressions only available with -std=c++11 or -std=gnu++11
2822zoo_service_loader.c:31:19: error: expected unqualified-id before '(' token
2823 #define length(x) (sizeof(x) / sizeof(x[0]))
2824                   ^
2825zoo_service_loader.c:31:28: error: expected primary-expression before ')' token
2826 #define length(x) (sizeof(x) / sizeof(x[0]))
2827                            ^
2828zoo_service_loader.c:31:40: error: lambda-expression in unevaluated context
2829 #define length(x) (sizeof(x) / sizeof(x[0]))
2830                                        ^
2831zoo_service_loader.c:31:41: error: expected identifier before numeric constant
2832 #define length(x) (sizeof(x) / sizeof(x[0]))
2833                                         ^
2834zoo_service_loader.c:31:43: error: expected '{' before ')' token
2835 #define length(x) (sizeof(x) / sizeof(x[0]))
2836                                           ^
2837zoo_service_loader.c:31:43: warning: lambda expressions only available with -std=c++11 or -std=gnu++11
2838/usr/include/i386-linux-gnu/unicode/unistr.h: In member function 'void icu_55::UnicodeString::doExtract(int32_t, int32_t, icu_55::UnicodeString&) const':
2839zoo_service_loader.c:31:19: error: expected unqualified-id before '(' token
2840 #define length(x) (sizeof(x) / sizeof(x[0]))
2841                   ^
2842zoo_service_loader.c:31:28: error: expected primary-expression before ')' token
2843 #define length(x) (sizeof(x) / sizeof(x[0]))
2844                            ^
2845zoo_service_loader.c:31:40: error: lambda-expression in unevaluated context
2846 #define length(x) (sizeof(x) / sizeof(x[0]))
2847                                        ^
2848zoo_service_loader.c:31:41: error: expected identifier before numeric constant
2849 #define length(x) (sizeof(x) / sizeof(x[0]))
2850                                         ^
2851zoo_service_loader.c:31:43: error: expected '{' before ')' token
2852 #define length(x) (sizeof(x) / sizeof(x[0]))
2853                                           ^
2854zoo_service_loader.c:31:43: warning: lambda expressions only available with -std=c++11 or -std=gnu++11
2855/usr/include/i386-linux-gnu/unicode/unistr.h: In member function 'UChar icu_55::UnicodeString::doCharAt(int32_t) const':
2856zoo_service_loader.c:31:28: error: expected primary-expression before ')' token
2857 #define length(x) (sizeof(x) / sizeof(x[0]))
2858                            ^
2859zoo_service_loader.c:31:40: error: lambda-expression in unevaluated context
2860 #define length(x) (sizeof(x) / sizeof(x[0]))
2861                                        ^
2862zoo_service_loader.c:31:41: error: expected identifier before numeric constant
2863 #define length(x) (sizeof(x) / sizeof(x[0]))
2864                                         ^
2865zoo_service_loader.c:31:43: error: expected '{' before ')' token
2866 #define length(x) (sizeof(x) / sizeof(x[0]))
2867                                           ^
2868zoo_service_loader.c:31:43: warning: lambda expressions only available with -std=c++11 or -std=gnu++11
2869/usr/include/i386-linux-gnu/unicode/unistr.h: In member function 'icu_55::UnicodeString& icu_55::UnicodeString::operator=(UChar)':
2870zoo_service_loader.c:31:28: error: expected primary-expression before ')' token
2871 #define length(x) (sizeof(x) / sizeof(x[0]))
2872                            ^
2873zoo_service_loader.c:31:40: error: lambda-expression in unevaluated context
2874 #define length(x) (sizeof(x) / sizeof(x[0]))
2875                                        ^
2876zoo_service_loader.c:31:41: error: expected identifier before numeric constant
2877 #define length(x) (sizeof(x) / sizeof(x[0]))
2878                                         ^
2879zoo_service_loader.c:31:43: error: expected '{' before ')' token
2880 #define length(x) (sizeof(x) / sizeof(x[0]))
2881                                           ^
2882zoo_service_loader.c:31:43: warning: lambda expressions only available with -std=c++11 or -std=gnu++11
2883/usr/include/i386-linux-gnu/unicode/unistr.h: In member function 'icu_55::UnicodeString& icu_55::UnicodeString::operator=(UChar32)':
2884zoo_service_loader.c:31:28: error: expected primary-expression before ')' token
2885 #define length(x) (sizeof(x) / sizeof(x[0]))
2886                            ^
2887zoo_service_loader.c:31:40: error: lambda-expression in unevaluated context
2888 #define length(x) (sizeof(x) / sizeof(x[0]))
2889                                        ^
2890zoo_service_loader.c:31:41: error: expected identifier before numeric constant
2891 #define length(x) (sizeof(x) / sizeof(x[0]))
2892                                         ^
2893zoo_service_loader.c:31:43: error: expected '{' before ')' token
2894 #define length(x) (sizeof(x) / sizeof(x[0]))
2895                                           ^
2896zoo_service_loader.c:31:43: warning: lambda expressions only available with -std=c++11 or -std=gnu++11
2897/usr/include/i386-linux-gnu/unicode/unistr.h: In member function 'icu_55::UnicodeString& icu_55::UnicodeString::setTo(const icu_55::UnicodeString&, int32_t, int32_t)':
2898zoo_service_loader.c:31:28: error: expected primary-expression before ')' token
2899 #define length(x) (sizeof(x) / sizeof(x[0]))
2900                            ^
2901zoo_service_loader.c:31:40: error: lambda-expression in unevaluated context
2902 #define length(x) (sizeof(x) / sizeof(x[0]))
2903                                        ^
2904zoo_service_loader.c:31:41: error: expected identifier before numeric constant
2905 #define length(x) (sizeof(x) / sizeof(x[0]))
2906                                         ^
2907zoo_service_loader.c:31:43: error: expected '{' before ')' token
2908 #define length(x) (sizeof(x) / sizeof(x[0]))
2909                                           ^
2910zoo_service_loader.c:31:43: warning: lambda expressions only available with -std=c++11 or -std=gnu++11
2911/usr/include/i386-linux-gnu/unicode/unistr.h: In member function 'icu_55::UnicodeString& icu_55::UnicodeString::setTo(const icu_55::UnicodeString&, int32_t)':
2912zoo_service_loader.c:31:28: error: expected primary-expression before ')' token
2913 #define length(x) (sizeof(x) / sizeof(x[0]))
2914                            ^
2915zoo_service_loader.c:31:40: error: lambda-expression in unevaluated context
2916 #define length(x) (sizeof(x) / sizeof(x[0]))
2917                                        ^
2918zoo_service_loader.c:31:41: error: expected identifier before numeric constant
2919 #define length(x) (sizeof(x) / sizeof(x[0]))
2920                                         ^
2921zoo_service_loader.c:31:43: error: expected '{' before ')' token
2922 #define length(x) (sizeof(x) / sizeof(x[0]))
2923                                           ^
2924zoo_service_loader.c:31:43: warning: lambda expressions only available with -std=c++11 or -std=gnu++11
2925zoo_service_loader.c:31:19: error: expected unqualified-id before '(' token
2926 #define length(x) (sizeof(x) / sizeof(x[0]))
2927                   ^
2928zoo_service_loader.c:31:28: error: expected primary-expression before ')' token
2929 #define length(x) (sizeof(x) / sizeof(x[0]))
2930                            ^
2931zoo_service_loader.c:31:40: error: lambda-expression in unevaluated context
2932 #define length(x) (sizeof(x) / sizeof(x[0]))
2933                                        ^
2934zoo_service_loader.c:31:41: error: expected identifier before numeric constant
2935 #define length(x) (sizeof(x) / sizeof(x[0]))
2936                                         ^
2937zoo_service_loader.c:31:43: error: expected '{' before ')' token
2938 #define length(x) (sizeof(x) / sizeof(x[0]))
2939                                           ^
2940zoo_service_loader.c:31:43: warning: lambda expressions only available with -std=c++11 or -std=gnu++11
2941/usr/include/i386-linux-gnu/unicode/unistr.h: In member function 'icu_55::UnicodeString& icu_55::UnicodeString::setTo(const UChar*, int32_t)':
2942zoo_service_loader.c:31:28: error: expected primary-expression before ')' token
2943 #define length(x) (sizeof(x) / sizeof(x[0]))
2944                            ^
2945zoo_service_loader.c:31:40: error: lambda-expression in unevaluated context
2946 #define length(x) (sizeof(x) / sizeof(x[0]))
2947                                        ^
2948zoo_service_loader.c:31:41: error: expected identifier before numeric constant
2949 #define length(x) (sizeof(x) / sizeof(x[0]))
2950                                         ^
2951zoo_service_loader.c:31:43: error: expected '{' before ')' token
2952 #define length(x) (sizeof(x) / sizeof(x[0]))
2953                                           ^
2954zoo_service_loader.c:31:43: warning: lambda expressions only available with -std=c++11 or -std=gnu++11
2955/usr/include/i386-linux-gnu/unicode/unistr.h: In member function 'icu_55::UnicodeString& icu_55::UnicodeString::setTo(UChar)':
2956zoo_service_loader.c:31:28: error: expected primary-expression before ')' token
2957 #define length(x) (sizeof(x) / sizeof(x[0]))
2958                            ^
2959zoo_service_loader.c:31:40: error: lambda-expression in unevaluated context
2960 #define length(x) (sizeof(x) / sizeof(x[0]))
2961                                        ^
2962zoo_service_loader.c:31:41: error: expected identifier before numeric constant
2963 #define length(x) (sizeof(x) / sizeof(x[0]))
2964                                         ^
2965zoo_service_loader.c:31:43: error: expected '{' before ')' token
2966 #define length(x) (sizeof(x) / sizeof(x[0]))
2967                                           ^
2968zoo_service_loader.c:31:43: warning: lambda expressions only available with -std=c++11 or -std=gnu++11
2969/usr/include/i386-linux-gnu/unicode/unistr.h: In member function 'icu_55::UnicodeString& icu_55::UnicodeString::setTo(UChar32)':
2970zoo_service_loader.c:31:28: error: expected primary-expression before ')' token
2971 #define length(x) (sizeof(x) / sizeof(x[0]))
2972                            ^
2973zoo_service_loader.c:31:40: error: lambda-expression in unevaluated context
2974 #define length(x) (sizeof(x) / sizeof(x[0]))
2975                                        ^
2976zoo_service_loader.c:31:41: error: expected identifier before numeric constant
2977 #define length(x) (sizeof(x) / sizeof(x[0]))
2978                                         ^
2979zoo_service_loader.c:31:43: error: expected '{' before ')' token
2980 #define length(x) (sizeof(x) / sizeof(x[0]))
2981                                           ^
2982zoo_service_loader.c:31:43: warning: lambda expressions only available with -std=c++11 or -std=gnu++11
2983/usr/include/i386-linux-gnu/unicode/unistr.h: In member function 'icu_55::UnicodeString& icu_55::UnicodeString::append(const icu_55::UnicodeString&, int32_t, int32_t)':
2984zoo_service_loader.c:31:28: error: expected primary-expression before ')' token
2985 #define length(x) (sizeof(x) / sizeof(x[0]))
2986                            ^
2987zoo_service_loader.c:31:40: error: lambda-expression in unevaluated context
2988 #define length(x) (sizeof(x) / sizeof(x[0]))
2989                                        ^
2990zoo_service_loader.c:31:41: error: expected identifier before numeric constant
2991 #define length(x) (sizeof(x) / sizeof(x[0]))
2992                                         ^
2993zoo_service_loader.c:31:43: error: expected '{' before ')' token
2994 #define length(x) (sizeof(x) / sizeof(x[0]))
2995                                           ^
2996zoo_service_loader.c:31:43: warning: lambda expressions only available with -std=c++11 or -std=gnu++11
2997/usr/include/i386-linux-gnu/unicode/unistr.h: In member function 'icu_55::UnicodeString& icu_55::UnicodeString::append(const icu_55::UnicodeString&)':
2998zoo_service_loader.c:31:28: error: expected primary-expression before ')' token
2999 #define length(x) (sizeof(x) / sizeof(x[0]))
3000                            ^
3001zoo_service_loader.c:31:40: error: lambda-expression in unevaluated context
3002 #define length(x) (sizeof(x) / sizeof(x[0]))
3003                                        ^
3004zoo_service_loader.c:31:41: error: expected identifier before numeric constant
3005 #define length(x) (sizeof(x) / sizeof(x[0]))
3006                                         ^
3007zoo_service_loader.c:31:43: error: expected '{' before ')' token
3008 #define length(x) (sizeof(x) / sizeof(x[0]))
3009                                           ^
3010zoo_service_loader.c:31:43: warning: lambda expressions only available with -std=c++11 or -std=gnu++11
3011zoo_service_loader.c:31:19: error: expected unqualified-id before '(' token
3012 #define length(x) (sizeof(x) / sizeof(x[0]))
3013                   ^
3014zoo_service_loader.c:31:28: error: expected primary-expression before ')' token
3015 #define length(x) (sizeof(x) / sizeof(x[0]))
3016                            ^
3017zoo_service_loader.c:31:40: error: lambda-expression in unevaluated context
3018 #define length(x) (sizeof(x) / sizeof(x[0]))
3019                                        ^
3020zoo_service_loader.c:31:41: error: expected identifier before numeric constant
3021 #define length(x) (sizeof(x) / sizeof(x[0]))
3022                                         ^
3023zoo_service_loader.c:31:43: error: expected '{' before ')' token
3024 #define length(x) (sizeof(x) / sizeof(x[0]))
3025                                           ^
3026zoo_service_loader.c:31:43: warning: lambda expressions only available with -std=c++11 or -std=gnu++11
3027/usr/include/i386-linux-gnu/unicode/unistr.h: In member function 'icu_55::UnicodeString& icu_55::UnicodeString::append(const UChar*, int32_t, int32_t)':
3028zoo_service_loader.c:31:28: error: expected primary-expression before ')' token
3029 #define length(x) (sizeof(x) / sizeof(x[0]))
3030                            ^
3031zoo_service_loader.c:31:40: error: lambda-expression in unevaluated context
3032 #define length(x) (sizeof(x) / sizeof(x[0]))
3033                                        ^
3034zoo_service_loader.c:31:41: error: expected identifier before numeric constant
3035 #define length(x) (sizeof(x) / sizeof(x[0]))
3036                                         ^
3037zoo_service_loader.c:31:43: error: expected '{' before ')' token
3038 #define length(x) (sizeof(x) / sizeof(x[0]))
3039                                           ^
3040zoo_service_loader.c:31:43: warning: lambda expressions only available with -std=c++11 or -std=gnu++11
3041/usr/include/i386-linux-gnu/unicode/unistr.h: In member function 'icu_55::UnicodeString& icu_55::UnicodeString::append(const UChar*, int32_t)':
3042zoo_service_loader.c:31:28: error: expected primary-expression before ')' token
3043 #define length(x) (sizeof(x) / sizeof(x[0]))
3044                            ^
3045zoo_service_loader.c:31:40: error: lambda-expression in unevaluated context
3046 #define length(x) (sizeof(x) / sizeof(x[0]))
3047                                        ^
3048zoo_service_loader.c:31:41: error: expected identifier before numeric constant
3049 #define length(x) (sizeof(x) / sizeof(x[0]))
3050                                         ^
3051zoo_service_loader.c:31:43: error: expected '{' before ')' token
3052 #define length(x) (sizeof(x) / sizeof(x[0]))
3053                                           ^
3054zoo_service_loader.c:31:43: warning: lambda expressions only available with -std=c++11 or -std=gnu++11
3055/usr/include/i386-linux-gnu/unicode/unistr.h: In member function 'icu_55::UnicodeString& icu_55::UnicodeString::append(UChar)':
3056zoo_service_loader.c:31:28: error: expected primary-expression before ')' token
3057 #define length(x) (sizeof(x) / sizeof(x[0]))
3058                            ^
3059zoo_service_loader.c:31:40: error: lambda-expression in unevaluated context
3060 #define length(x) (sizeof(x) / sizeof(x[0]))
3061                                        ^
3062zoo_service_loader.c:31:41: error: expected identifier before numeric constant
3063 #define length(x) (sizeof(x) / sizeof(x[0]))
3064                                         ^
3065zoo_service_loader.c:31:43: error: expected '{' before ')' token
3066 #define length(x) (sizeof(x) / sizeof(x[0]))
3067                                           ^
3068zoo_service_loader.c:31:43: warning: lambda expressions only available with -std=c++11 or -std=gnu++11
3069/usr/include/i386-linux-gnu/unicode/unistr.h: In member function 'icu_55::UnicodeString& icu_55::UnicodeString::operator+=(UChar)':
3070zoo_service_loader.c:31:28: error: expected primary-expression before ')' token
3071 #define length(x) (sizeof(x) / sizeof(x[0]))
3072                            ^
3073zoo_service_loader.c:31:40: error: lambda-expression in unevaluated context
3074 #define length(x) (sizeof(x) / sizeof(x[0]))
3075                                        ^
3076zoo_service_loader.c:31:41: error: expected identifier before numeric constant
3077 #define length(x) (sizeof(x) / sizeof(x[0]))
3078                                         ^
3079zoo_service_loader.c:31:43: error: expected '{' before ')' token
3080 #define length(x) (sizeof(x) / sizeof(x[0]))
3081                                           ^
3082zoo_service_loader.c:31:43: warning: lambda expressions only available with -std=c++11 or -std=gnu++11
3083/usr/include/i386-linux-gnu/unicode/unistr.h: In member function 'icu_55::UnicodeString& icu_55::UnicodeString::operator+=(const icu_55::UnicodeString&)':
3084zoo_service_loader.c:31:28: error: expected primary-expression before ')' token
3085 #define length(x) (sizeof(x) / sizeof(x[0]))
3086                            ^
3087zoo_service_loader.c:31:40: error: lambda-expression in unevaluated context
3088 #define length(x) (sizeof(x) / sizeof(x[0]))
3089                                        ^
3090zoo_service_loader.c:31:41: error: expected identifier before numeric constant
3091 #define length(x) (sizeof(x) / sizeof(x[0]))
3092                                         ^
3093zoo_service_loader.c:31:43: error: expected '{' before ')' token
3094 #define length(x) (sizeof(x) / sizeof(x[0]))
3095                                           ^
3096zoo_service_loader.c:31:43: warning: lambda expressions only available with -std=c++11 or -std=gnu++11
3097zoo_service_loader.c:31:19: error: expected unqualified-id before '(' token
3098 #define length(x) (sizeof(x) / sizeof(x[0]))
3099                   ^
3100zoo_service_loader.c:31:28: error: expected primary-expression before ')' token
3101 #define length(x) (sizeof(x) / sizeof(x[0]))
3102                            ^
3103zoo_service_loader.c:31:40: error: lambda-expression in unevaluated context
3104 #define length(x) (sizeof(x) / sizeof(x[0]))
3105                                        ^
3106zoo_service_loader.c:31:41: error: expected identifier before numeric constant
3107 #define length(x) (sizeof(x) / sizeof(x[0]))
3108                                         ^
3109zoo_service_loader.c:31:43: error: expected '{' before ')' token
3110 #define length(x) (sizeof(x) / sizeof(x[0]))
3111                                           ^
3112zoo_service_loader.c:31:43: warning: lambda expressions only available with -std=c++11 or -std=gnu++11
3113/usr/include/i386-linux-gnu/unicode/unistr.h: In member function 'icu_55::UnicodeString& icu_55::UnicodeString::insert(int32_t, const icu_55::UnicodeString&)':
3114zoo_service_loader.c:31:19: error: expected unqualified-id before '(' token
3115 #define length(x) (sizeof(x) / sizeof(x[0]))
3116                   ^
3117zoo_service_loader.c:31:28: error: expected primary-expression before ')' token
3118 #define length(x) (sizeof(x) / sizeof(x[0]))
3119                            ^
3120zoo_service_loader.c:31:40: error: lambda-expression in unevaluated context
3121 #define length(x) (sizeof(x) / sizeof(x[0]))
3122                                        ^
3123zoo_service_loader.c:31:41: error: expected identifier before numeric constant
3124 #define length(x) (sizeof(x) / sizeof(x[0]))
3125                                         ^
3126zoo_service_loader.c:31:43: error: expected '{' before ')' token
3127 #define length(x) (sizeof(x) / sizeof(x[0]))
3128                                           ^
3129zoo_service_loader.c:31:43: warning: lambda expressions only available with -std=c++11 or -std=gnu++11
3130/usr/include/i386-linux-gnu/unicode/unistr.h: In member function 'UBool icu_55::UnicodeString::truncate(int32_t)':
3131zoo_service_loader.c:31:28: error: expected primary-expression before ')' token
3132 #define length(x) (sizeof(x) / sizeof(x[0]))
3133                            ^
3134zoo_service_loader.c:31:40: error: lambda-expression in unevaluated context
3135 #define length(x) (sizeof(x) / sizeof(x[0]))
3136                                        ^
3137zoo_service_loader.c:31:41: error: expected identifier before numeric constant
3138 #define length(x) (sizeof(x) / sizeof(x[0]))
3139                                         ^
3140zoo_service_loader.c:31:43: error: expected '{' before ')' token
3141 #define length(x) (sizeof(x) / sizeof(x[0]))
3142                                           ^
3143zoo_service_loader.c:31:43: warning: lambda expressions only available with -std=c++11 or -std=gnu++11
3144/usr/include/i386-linux-gnu/unicode/unistr.h: In member function 'icu_55::UnicodeString& icu_55::UnicodeString::reverse()':
3145zoo_service_loader.c:31:28: error: expected primary-expression before ')' token
3146 #define length(x) (sizeof(x) / sizeof(x[0]))
3147                            ^
3148zoo_service_loader.c:31:40: error: lambda-expression in unevaluated context
3149 #define length(x) (sizeof(x) / sizeof(x[0]))
3150                                        ^
3151zoo_service_loader.c:31:41: error: expected identifier before numeric constant
3152 #define length(x) (sizeof(x) / sizeof(x[0]))
3153                                         ^
3154zoo_service_loader.c:31:43: error: expected '{' before ')' token
3155 #define length(x) (sizeof(x) / sizeof(x[0]))
3156                                           ^
3157zoo_service_loader.c:31:43: warning: lambda expressions only available with -std=c++11 or -std=gnu++11
3158In file included from zoo_service_loader.c:52:0:
3159response_print.h: At global scope:
3160response_print.h:174:3: warning: converting to non-pointer type 'char' from NULL [-Wconversion-null]
3161   };
3162   ^
3163response_print.h:174:3: warning: converting to non-pointer type 'char' from NULL [-Wconversion-null]
3164In file included from /usr/include/python2.7/Python.h:58:0,
3165                 from service_internal_python.h:32,
3166                 from zoo_service_loader.c:60:
3167/usr/include/python2.7/pyport.h:901:44: warning: 'FCGI_printf' is an unrecognized format function type [-Wformat=]
3168 #define Py_GCC_ATTRIBUTE(x) __attribute__(x)
3169                                            ^
3170/usr/include/python2.7/stringobject.h:65:5: note: in expansion of macro 'Py_GCC_ATTRIBUTE'
3171     Py_GCC_ATTRIBUTE((format(printf, 1, 0)));
3172     ^
3173/usr/include/python2.7/pyport.h:901:44: warning: 'FCGI_printf' is an unrecognized format function type [-Wformat=]
3174 #define Py_GCC_ATTRIBUTE(x) __attribute__(x)
3175                                            ^
3176/usr/include/python2.7/stringobject.h:67:5: note: in expansion of macro 'Py_GCC_ATTRIBUTE'
3177     Py_GCC_ATTRIBUTE((format(printf, 1, 2)));
3178     ^
3179/usr/include/python2.7/pyport.h:901:44: warning: 'FCGI_printf' is an unrecognized format function type [-Wformat=]
3180 #define Py_GCC_ATTRIBUTE(x) __attribute__(x)
3181                                            ^
3182/usr/include/python2.7/pyerrors.h:197:25: note: in expansion of macro 'Py_GCC_ATTRIBUTE'
3183                         Py_GCC_ATTRIBUTE((format(printf, 2, 3)));
3184                         ^
3185/usr/include/python2.7/pyport.h:901:44: warning: 'FCGI_printf' is an unrecognized format function type [-Wformat=]
3186 #define Py_GCC_ATTRIBUTE(x) __attribute__(x)
3187                                            ^
3188/usr/include/python2.7/pyerrors.h:322:25: note: in expansion of macro 'Py_GCC_ATTRIBUTE'
3189                         Py_GCC_ATTRIBUTE((format(printf, 3, 4)));
3190                         ^
3191/usr/include/python2.7/pyport.h:901:44: warning: 'FCGI_printf' is an unrecognized format function type [-Wformat=]
3192 #define Py_GCC_ATTRIBUTE(x) __attribute__(x)
3193                                            ^
3194/usr/include/python2.7/pyerrors.h:324:25: note: in expansion of macro 'Py_GCC_ATTRIBUTE'
3195                         Py_GCC_ATTRIBUTE((format(printf, 3, 0)));
3196                         ^
3197/usr/include/python2.7/pyport.h:901:44: warning: 'FCGI_printf' is an unrecognized format function type [-Wformat=]
3198 #define Py_GCC_ATTRIBUTE(x) __attribute__(x)
3199                                            ^
3200/usr/include/python2.7/sysmodule.h:18:4: note: in expansion of macro 'Py_GCC_ATTRIBUTE'
3201    Py_GCC_ATTRIBUTE((format(printf, 1, 2)));
3202    ^
3203/usr/include/python2.7/pyport.h:901:44: warning: 'FCGI_printf' is an unrecognized format function type [-Wformat=]
3204 #define Py_GCC_ATTRIBUTE(x) __attribute__(x)
3205                                            ^
3206/usr/include/python2.7/sysmodule.h:20:4: note: in expansion of macro 'Py_GCC_ATTRIBUTE'
3207    Py_GCC_ATTRIBUTE((format(printf, 1, 2)));
3208    ^
3209zoo_service_loader.c: In function 'void loadServiceAndRun(maps**, service*, map*, maps**, maps**, int*)':
3210zoo_service_loader.c:416:22: warning: ignoring return value of 'char* getcwd(char*, size_t)', declared with attribute warn_unused_result [-Wunused-result]
3211   getcwd (ntmp, 1024);
3212                      ^
3213zoo_service_loader.c: In function 'int runRequest(map**)':
3214zoo_service_loader.c:916:22: warning: ignoring return value of 'char* getcwd(char*, size_t)', declared with attribute warn_unused_result [-Wunused-result]
3215   getcwd (ntmp, 1024);
3216                      ^
3217Makefile:93: recipe for target 'zoo_service_loader.o' failed
3218make[2]: *** [zoo_service_loader.o] Error 1
3219make[2]: Leaving directory '/tmp/buildd/zoo-project-1.6.0~rev771/zoo-project/zoo-kernel'
3220dh_auto_build: make -j1 returned exit code 2
3221debian/rules:11: recipe for target 'override_dh_auto_build' failed
3222make[1]: *** [override_dh_auto_build] Error 2
3223make[1]: Leaving directory '/tmp/buildd/zoo-project-1.6.0~rev771'
3224debian/rules:5: recipe for target 'build' failed
3225make: *** [build] Error 2
3226dpkg-buildpackage: error: debian/rules build gave error exit status 2
3227E: Failed autobuilding of package
3228I: unmounting dev/pts filesystem
3229I: unmounting run/shm filesystem
3230I: unmounting proc filesystem
3231 -> Cleaning COW directory
3232  forking: rm -rf /var/cache/pbuilder/build//cow.11223