Opened 5 weeks ago

Last modified 5 weeks ago

#996 new defect

Windows CMake Mingw64 32-bit gcc 8.1.0

Reported by: robe Owned by: geos-devel@…
Priority: minor Milestone: 3.8.1
Component: Default Version: master
Severity: Significant Keywords:
Cc:

Description (last modified by robe)

This has been failing for a while I think. No rush -- can revisit at 3.8.1. No one uses 32-bit on windows PostgreSQL anymore so don't much care.

https://winnie.postgis.net:444/job/GEOS_matrix_tag/GCC_TYPE=gcc81,MAKE_TYPE=cmake,OS_BUILD=32/23/consoleFull

Test project E:/jenkins/geos/tags/build32cmake
        Start   1: unit-algorithm-Angle
  1/258 Test   #1: unit-algorithm-Angle .....................................   Passed    0.08 sec
        Start   2: unit-algorithm-Area
  2/258 Test   #2: unit-algorithm-Area ......................................   Passed    0.08 sec
        Start   3: unit-algorithm-CGAlgorithms-computeOrientation
  3/258 Test   #3: unit-algorithm-CGAlgorithms-computeOrientation ...........   Passed    0.08 sec
        Start   4: unit-algorithm-CGAlgorithms-isCCW
  4/258 Test   #4: unit-algorithm-CGAlgorithms-isCCW ........................   Passed    0.09 sec
        Start   5: unit-algorithm-CGAlgorithms-isPointInRing
  5/258 Test   #5: unit-algorithm-CGAlgorithms-isPointInRing ................   Passed    0.09 sec
        Start   6: unit-algorithm-CGAlgorithms-signedArea
  6/258 Test   #6: unit-algorithm-CGAlgorithms-signedArea ...................   Passed    0.09 sec
        Start   7: unit-algorithm-ConvexHull
  7/258 Test   #7: unit-algorithm-ConvexHull ................................   Passed    0.09 sec
        Start   8: unit-algorithm-InteriorPointArea
  8/258 Test   #8: unit-algorithm-InteriorPointArea .........................   Passed    0.09 sec
        Start   9: unit-algorithm-Intersection
  9/258 Test   #9: unit-algorithm-Intersection ..............................   Passed    0.09 sec
        Start  10: unit-algorithm-Length
 10/258 Test  #10: unit-algorithm-Length ....................................   Passed    0.09 sec
        Start  11: unit-algorithm-LocatePointInRing
 11/258 Test  #11: unit-algorithm-LocatePointInRing .........................   Passed    0.09 sec
        Start  12: unit-algorithm-MinimumBoundingCircle
 12/258 Test  #12: unit-algorithm-MinimumBoundingCircle .....................   Passed    0.09 sec
        Start  13: unit-algorithm-MinimumDiameter
 13/258 Test  #13: unit-algorithm-MinimumDiameter ...........................   Passed    0.09 sec
        Start  14: unit-algorithm-OrientationIndexFailure
 14/258 Test  #14: unit-algorithm-OrientationIndexFailure ...................   Passed    0.09 sec
        Start  15: unit-algorithm-PointLocator
 15/258 Test  #15: unit-algorithm-PointLocator ..............................   Passed    0.12 sec
        Start  16: unit-algorithm-RobustLineIntersection
 16/258 Test  #16: unit-algorithm-RobustLineIntersection ....................***Failed    0.14 sec
        Start  17: unit-algorithm-RobustLineIntersector
 17/258 Test  #17: unit-algorithm-RobustLineIntersector .....................   Passed    0.10 sec
        Start  18: unit-algorithm-distance-DiscreteFrechetDistance
 18/258 Test  #18: unit-algorithm-distance-DiscreteFrechetDistance ..........   Passed    0.10 sec
        Start  19: unit-algorithm-distance-DiscreteHausdorffDistance
 19/258 Test  #19: unit-algorithm-distance-DiscreteHausdorffDistance ........   Passed    0.07 sec
        Start  20: unit-capi-GEOSBuffer
 20/258 Test  #20: unit-capi-GEOSBuffer .....................................   Passed    0.10 sec
        Start  21: unit-capi-GEOSBuildArea
 21/258 Test  #21: unit-capi-GEOSBuildArea ..................................   Passed    0.09 sec
        Start  22: unit-capi-GEOSCAPIDefines
 22/258 Test  #22: unit-capi-GEOSCAPIDefines ................................   Passed    0.10 sec
        Start  23: unit-capi-GEOSClipByRect
 23/258 Test  #23: unit-capi-GEOSClipByRect .................................   Passed    0.10 sec
        Start  24: unit-capi-GEOSContains
 24/258 Test  #24: unit-capi-GEOSContains ...................................   Passed    0.07 sec
        Start  25: unit-capi-GEOSConvexHull
 25/258 Test  #25: unit-capi-GEOSConvexHull .................................   Passed    0.13 sec
        Start  26: unit-capi-GEOSCoordSeq
 26/258 Test  #26: unit-capi-GEOSCoordSeq ...................................   Passed    0.11 sec
        Start  27: unit-capi-GEOSCoverageUnion
 27/258 Test  #27: unit-capi-GEOSCoverageUnion ..............................   Passed    0.08 sec
        Start  28: unit-capi-GEOSDelaunayTriangulation
 28/258 Test  #28: unit-capi-GEOSDelaunayTriangulation ......................   Passed    0.08 sec
        Start  29: unit-capi-GEOSDistance
 29/258 Test  #29: unit-capi-GEOSDistance ...................................   Passed    0.19 sec
        Start  30: unit-capi-GEOSEquals
 30/258 Test  #30: unit-capi-GEOSEquals .....................................   Passed    0.09 sec
        Start  31: unit-capi-GEOSFrechetDistance
 31/258 Test  #31: unit-capi-GEOSFrechetDistance ............................   Passed    0.09 sec
        Start  32: unit-capi-GEOSGeomFromWKB
 32/258 Test  #32: unit-capi-GEOSGeomFromWKB ................................   Passed    0.09 sec
        Start  33: unit-capi-GEOSGeomToWKT
 33/258 Test  #33: unit-capi-GEOSGeomToWKT ..................................   Passed    0.09 sec
        Start  34: unit-capi-GEOSGeom_createCollection
 34/258 Test  #34: unit-capi-GEOSGeom_createCollection ......................   Passed    0.09 sec
        Start  35: unit-capi-GEOSGeom_create
 35/258 Test  #35: unit-capi-GEOSGeom_create ................................   Passed    0.09 sec
        Start  36: unit-capi-GEOSGeom_extent
 36/258 Test  #36: unit-capi-GEOSGeom_extent ................................   Passed    0.09 sec
        Start  37: unit-capi-GEOSGeom_extractUniquePoints
 37/258 Test  #37: unit-capi-GEOSGeom_extractUniquePoints ...................   Passed    0.09 sec
        Start  38: unit-capi-GEOSGeom_setPrecision
 38/258 Test  #38: unit-capi-GEOSGeom_setPrecision ..........................   Passed    0.09 sec
        Start  39: unit-capi-GEOSGetCentroid
 39/258 Test  #39: unit-capi-GEOSGetCentroid ................................   Passed    0.09 sec
        Start  40: unit-capi-GEOSHausdorffDistance
 40/258 Test  #40: unit-capi-GEOSHausdorffDistance ..........................   Passed    0.09 sec
        Start  41: unit-capi-GEOSInterpolate
 41/258 Test  #41: unit-capi-GEOSInterpolate ................................   Passed    0.09 sec
        Start  42: unit-capi-GEOSInterrupt
 42/258 Test  #42: unit-capi-GEOSInterrupt ..................................   Passed    0.09 sec
        Start  43: unit-capi-GEOSIntersection
 43/258 Test  #43: unit-capi-GEOSIntersection ...............................   Passed    0.09 sec
        Start  44: unit-capi-GEOSIntersects
 44/258 Test  #44: unit-capi-GEOSIntersects .................................   Passed    0.09 sec
        Start  45: unit-capi-GEOSLineString_Point
 45/258 Test  #45: unit-capi-GEOSLineString_Point ...........................   Passed    0.09 sec
        Start  46: unit-capi-GEOSMakeValid
 46/258 Test  #46: unit-capi-GEOSMakeValid ..................................   Passed    0.09 sec
        Start  47: unit-capi-GEOSMinimumBoundingCircle
 47/258 Test  #47: unit-capi-GEOSMinimumBoundingCircle ......................   Passed    0.09 sec
        Start  48: unit-capi-GEOSMinimumClearance
 48/258 Test  #48: unit-capi-GEOSMinimumClearance ...........................   Passed    0.09 sec
        Start  49: unit-capi-GEOSMinimumRectangle
 49/258 Test  #49: unit-capi-GEOSMinimumRectangle ...........................   Passed    0.09 sec
        Start  50: unit-capi-GEOSMinimumWidth
 50/258 Test  #50: unit-capi-GEOSMinimumWidth ...............................   Passed    0.09 sec
        Start  51: unit-capi-GEOSNearestPoints
 51/258 Test  #51: unit-capi-GEOSNearestPoints ..............................   Passed    0.09 sec
        Start  52: unit-capi-GEOSNode
 52/258 Test  #52: unit-capi-GEOSNode .......................................   Passed    0.09 sec
        Start  53: unit-capi-GEOSOffsetCurve
 53/258 Test  #53: unit-capi-GEOSOffsetCurve ................................   Passed    0.10 sec
        Start  54: unit-capi-GEOSOrientationIndex
 54/258 Test  #54: unit-capi-GEOSOrientationIndex ...........................   Passed    0.09 sec
        Start  55: unit-capi-GEOSPointOnSurface
 55/258 Test  #55: unit-capi-GEOSPointOnSurface .............................   Passed    0.09 sec
        Start  56: unit-capi-GEOSPolygonize
 56/258 Test  #56: unit-capi-GEOSPolygonize .................................   Passed    0.09 sec
        Start  57: unit-capi-GEOSPreparedGeometry
 57/258 Test  #57: unit-capi-GEOSPreparedGeometry ...........................   Passed    0.10 sec
        Start  58: unit-capi-GEOSRelateBoundaryNodeRule
 58/258 Test  #58: unit-capi-GEOSRelateBoundaryNodeRule .....................   Passed    0.09 sec
        Start  59: unit-capi-GEOSRelatePatternMatch
 59/258 Test  #59: unit-capi-GEOSRelatePatternMatch .........................   Passed    0.09 sec
        Start  60: unit-capi-GEOSReverse
 60/258 Test  #60: unit-capi-GEOSReverse ....................................   Passed    0.09 sec
        Start  61: unit-capi-GEOSSTRtree
 61/258 Test  #61: unit-capi-GEOSSTRtree ....................................   Passed    0.12 sec
        Start  62: unit-capi-GEOSSegmentIntersection
 62/258 Test  #62: unit-capi-GEOSSegmentIntersection ........................   Passed    0.09 sec
        Start  63: unit-capi-GEOSSharedPaths
 63/258 Test  #63: unit-capi-GEOSSharedPaths ................................   Passed    0.09 sec
        Start  64: unit-capi-GEOSSimplify
 64/258 Test  #64: unit-capi-GEOSSimplify ...................................   Passed    0.09 sec
        Start  65: unit-capi-GEOSSnap
 65/258 Test  #65: unit-capi-GEOSSnap .......................................   Passed    0.09 sec
        Start  66: unit-capi-GEOSUnaryUnion
 66/258 Test  #66: unit-capi-GEOSUnaryUnion .................................   Passed    0.10 sec
        Start  67: unit-capi-GEOSUserData
 67/258 Test  #67: unit-capi-GEOSUserData ...................................   Passed    0.09 sec
        Start  68: unit-capi-GEOSVoronoiDiagram
 68/258 Test  #68: unit-capi-GEOSVoronoiDiagram .............................   Passed    0.11 sec
        Start  69: unit-capi-GEOSWithin
 69/258 Test  #69: unit-capi-GEOSWithin .....................................   Passed    0.09 sec
        Start  70: unit-capi-GEOSisClosed
 70/258 Test  #70: unit-capi-GEOSisClosed ...................................   Passed    0.09 sec
        Start  71: unit-capi-GEOSisValidDetail
 71/258 Test  #71: unit-capi-GEOSisValidDetail ..............................   Passed    0.09 sec
        Start  72: unit-geom-CoordinateArraySequenceFactory
 72/258 Test  #72: unit-geom-CoordinateArraySequenceFactory .................   Passed    0.09 sec
        Start  73: unit-geom-CoordinateArraySequence
 73/258 Test  #73: unit-geom-CoordinateArraySequence ........................   Passed    0.09 sec
        Start  74: unit-geom-CoordinateList
 74/258 Test  #74: unit-geom-CoordinateList .................................   Passed    0.09 sec
        Start  75: unit-geom-Coordinate
 75/258 Test  #75: unit-geom-Coordinate .....................................   Passed    0.09 sec
        Start  76: unit-geom-Dimension
 76/258 Test  #76: unit-geom-Dimension ......................................   Passed    0.09 sec
        Start  77: unit-geom-Envelope
 77/258 Test  #77: unit-geom-Envelope .......................................   Passed    0.09 sec
        Start  78: unit-geom-FixedSizeCoordinateSequence
 78/258 Test  #78: unit-geom-FixedSizeCoordinateSequence ....................   Passed    0.09 sec
        Start  79: unit-geom-Geometry-clone
 79/258 Test  #79: unit-geom-Geometry-clone .................................   Passed    0.09 sec
        Start  80: unit-geom-Geometry-covers
 80/258 Test  #80: unit-geom-Geometry-covers ................................   Passed    0.09 sec
        Start  81: unit-geom-Geometry-equals
 81/258 Test  #81: unit-geom-Geometry-equals ................................   Passed    0.09 sec
        Start  82: unit-geom-Geometry-isRectangle
 82/258 Test  #82: unit-geom-Geometry-isRectangle ...........................   Passed    0.09 sec
        Start  83: unit-geom-Geometry-normalize
 83/258 Test  #83: unit-geom-Geometry-normalize .............................   Passed    0.09 sec
        Start  84: unit-geom-Geometry-touches
 84/258 Test  #84: unit-geom-Geometry-touches ...............................***Failed    0.09 sec
        Start  85: unit-geom-GeometryCollection
 85/258 Test  #85: unit-geom-GeometryCollection .............................   Passed    0.09 sec
        Start  86: unit-geom-GeometryComponentFilter
 86/258 Test  #86: unit-geom-GeometryComponentFilter ........................   Passed    0.09 sec
        Start  87: unit-geom-GeometryFactory
 87/258 Test  #87: unit-geom-GeometryFactory ................................   Passed    0.09 sec
        Start  88: unit-geom-GeometryFilter
 88/258 Test  #88: unit-geom-GeometryFilter .................................   Passed    0.09 sec
        Start  89: unit-geom-IntersectionMatrix
 89/258 Test  #89: unit-geom-IntersectionMatrix .............................   Passed    0.09 sec
        Start  90: unit-geom-LineSegment
 90/258 Test  #90: unit-geom-LineSegment ....................................   Passed    0.09 sec
        Start  91: unit-geom-LineString
 91/258 Test  #91: unit-geom-LineString .....................................   Passed    0.09 sec
        Start  92: unit-geom-LinearRing
 92/258 Test  #92: unit-geom-LinearRing .....................................   Passed    0.09 sec
        Start  93: unit-geom-Location
 93/258 Test  #93: unit-geom-Location .......................................   Passed    0.09 sec
        Start  94: unit-geom-MultiLineString
 94/258 Test  #94: unit-geom-MultiLineString ................................   Passed    0.09 sec
        Start  95: unit-geom-MultiPoint
 95/258 Test  #95: unit-geom-MultiPoint .....................................   Passed    0.09 sec
        Start  96: unit-geom-MultiPolygon
 96/258 Test  #96: unit-geom-MultiPolygon ...................................   Passed    0.09 sec
        Start  97: unit-geom-Point
 97/258 Test  #97: unit-geom-Point ..........................................   Passed    0.09 sec
        Start  98: unit-geom-Polygon
 98/258 Test  #98: unit-geom-Polygon ........................................   Passed    0.09 sec
        Start  99: unit-geom-PrecisionModel
 99/258 Test  #99: unit-geom-PrecisionModel .................................   Passed    0.09 sec
        Start 100: unit-geom-Triangle
100/258 Test #100: unit-geom-Triangle .......................................   Passed    0.09 sec
        Start 101: unit-geom-prep-PreparedGeometry-touches
101/258 Test #101: unit-geom-prep-PreparedGeometry-touches ..................   Passed    0.09 sec
        Start 102: unit-geom-prep-PreparedGeometryFactory
102/258 Test #102: unit-geom-prep-PreparedGeometryFactory ...................   Passed    0.10 sec
        Start 103: unit-geom-util-GeometryExtracter
103/258 Test #103: unit-geom-util-GeometryExtracter .........................   Passed    0.09 sec
        Start 104: unit-index-quadtree-DoubleBits
104/258 Test #104: unit-index-quadtree-DoubleBits ...........................   Passed    0.09 sec
        Start 105: unit-index-strtree-SIRtree
105/258 Test #105: unit-index-strtree-SIRtree ...............................   Passed    0.09 sec
        Start 106: unit-io-ByteOrderValues
106/258 Test #106: unit-io-ByteOrderValues ..................................   Passed    0.09 sec
        Start 107: unit-io-WKBReader
107/258 Test #107: unit-io-WKBReader ........................................   Passed    0.10 sec
        Start 108: unit-io-WKBWriter
108/258 Test #108: unit-io-WKBWriter ........................................   Passed    0.09 sec
        Start 109: unit-io-WKTReader
109/258 Test #109: unit-io-WKTReader ........................................   Passed    0.09 sec
        Start 110: unit-io-WKTWriter
110/258 Test #110: unit-io-WKTWriter ........................................   Passed    0.09 sec
        Start 111: unit-io-Writer
111/258 Test #111: unit-io-Writer ...........................................   Passed    0.09 sec
        Start 112: unit-linearref-LengthIndexedLine
112/258 Test #112: unit-linearref-LengthIndexedLine .........................***Failed    0.09 sec
        Start 113: unit-noding-BasicSegmentString
113/258 Test #113: unit-noding-BasicSegmentString ...........................   Passed    0.09 sec
        Start 114: unit-noding-NodedSegmentString
114/258 Test #114: unit-noding-NodedSegmentString ...........................   Passed    0.09 sec
        Start 115: unit-noding-OrientedCoordinateArray
115/258 Test #115: unit-noding-OrientedCoordinateArray ......................   Passed    0.09 sec
        Start 116: unit-noding-SegmentNode
116/258 Test #116: unit-noding-SegmentNode ..................................   Passed    0.09 sec
        Start 117: unit-noding-SegmentPointComparator
117/258 Test #117: unit-noding-SegmentPointComparator .......................   Passed    0.09 sec
        Start 118: unit-noding-snapround-HotPixel
118/258 Test #118: unit-noding-snapround-HotPixel ...........................   Passed    0.09 sec
        Start 119: unit-noding-snapround-MCIndexSnapRounder
119/258 Test #119: unit-noding-snapround-MCIndexSnapRounder .................   Passed    0.09 sec
        Start 120: unit-operation-IsSimpleOp
120/258 Test #120: unit-operation-IsSimpleOp ................................   Passed    0.29 sec
        Start 121: unit-operation-buffer-BufferBuilder
121/258 Test #121: unit-operation-buffer-BufferBuilder ......................   Passed    0.09 sec
        Start 122: unit-operation-buffer-BufferOp
122/258 Test #122: unit-operation-buffer-BufferOp ...........................   Passed    0.13 sec
        Start 123: unit-operation-buffer-BufferParameters
123/258 Test #123: unit-operation-buffer-BufferParameters ...................   Passed    0.09 sec
        Start 124: unit-operation-distance-DistanceOp
124/258 Test #124: unit-operation-distance-DistanceOp .......................   Passed    0.09 sec
        Start 125: unit-operation-distance-IndexedFacetDistance
125/258 Test #125: unit-operation-distance-IndexedFacetDistance .............   Passed    0.09 sec
        Start 126: unit-operation-geounion-CascadedPolygonUnion
126/258 Test #126: unit-operation-geounion-CascadedPolygonUnion .............   Passed    0.10 sec
        Start 127: unit-operation-geounion-CoverageUnion
127/258 Test #127: unit-operation-geounion-CoverageUnion ....................   Passed    0.10 sec
        Start 128: unit-operation-geounion-UnaryUnionOp
128/258 Test #128: unit-operation-geounion-UnaryUnionOp .....................   Passed    0.10 sec
        Start 129: unit-operation-intersection-RectangleIntersection
129/258 Test #129: unit-operation-intersection-RectangleIntersection ........   Passed    0.10 sec
        Start 130: unit-operation-linemerge-LineMerger
130/258 Test #130: unit-operation-linemerge-LineMerger ......................   Passed    0.09 sec
        Start 131: unit-operation-linemerge-LineSequencer
131/258 Test #131: unit-operation-linemerge-LineSequencer ...................   Passed    0.09 sec
        Start 132: unit-operation-overlay-OverlayOpUnion
132/258 Test #132: unit-operation-overlay-OverlayOpUnion ....................   Passed    0.09 sec
        Start 133: unit-operation-overlay-snap-GeometrySnapper
133/258 Test #133: unit-operation-overlay-snap-GeometrySnapper ..............   Passed    0.09 sec
        Start 134: unit-operation-overlay-snap-LineStringSnapper
134/258 Test #134: unit-operation-overlay-snap-LineStringSnapper ............   Passed    0.09 sec
        Start 135: unit-operation-overlay-validate-FuzzyPointLocator
135/258 Test #135: unit-operation-overlay-validate-FuzzyPointLocator ........   Passed    0.09 sec
        Start 136: unit-operation-overlay-validate-OffsetPointGenerator
136/258 Test #136: unit-operation-overlay-validate-OffsetPointGenerator .....   Passed    0.09 sec
        Start 137: unit-operation-overlay-validate-OverlayResultValidator
137/258 Test #137: unit-operation-overlay-validate-OverlayResultValidator ...   Passed    0.09 sec
        Start 138: unit-operation-polygonize-Polygonize
138/258 Test #138: unit-operation-polygonize-Polygonize .....................   Passed    0.10 sec
        Start 139: unit-operation-sharedpaths-SharedPathsOp
139/258 Test #139: unit-operation-sharedpaths-SharedPathsOp .................   Passed    0.09 sec
        Start 140: unit-operation-valid-IsValidOp
140/258 Test #140: unit-operation-valid-IsValidOp ...........................   Passed    0.08 sec
        Start 141: unit-operation-valid-RepeatedPointRemover
141/258 Test #141: unit-operation-valid-RepeatedPointRemover ................   Passed    0.09 sec
        Start 142: unit-operation-valid-ValidClosedRing
142/258 Test #142: unit-operation-valid-ValidClosedRing .....................   Passed    0.09 sec
        Start 143: unit-operation-valid-ValidSelfTouchingRingFormingHole
143/258 Test #143: unit-operation-valid-ValidSelfTouchingRingFormingHole ....   Passed    0.09 sec
        Start 144: unit-precision-CommonBits
144/258 Test #144: unit-precision-CommonBits ................................   Passed    0.09 sec
        Start 145: unit-precision-GeometryPrecisionReducer
145/258 Test #145: unit-precision-GeometryPrecisionReducer ..................   Passed    0.09 sec
        Start 146: unit-precision-SimpleGeometryPrecisionReducer
146/258 Test #146: unit-precision-SimpleGeometryPrecisionReducer ............   Passed    0.09 sec
        Start 147: unit-simplify-DouglasPeuckerSimplifier
147/258 Test #147: unit-simplify-DouglasPeuckerSimplifier ...................   Passed    0.10 sec
        Start 148: unit-simplify-TopologyPreservingSimplifier
148/258 Test #148: unit-simplify-TopologyPreservingSimplifier ...............   Passed    0.10 sec
        Start 149: unit-triangulate-Delaunay
149/258 Test #149: unit-triangulate-Delaunay ................................   Passed    0.10 sec
        Start 150: unit-triangulate-Voronoi
150/258 Test #150: unit-triangulate-Voronoi .................................   Passed    0.11 sec
        Start 151: unit-triangulate-quadedge-QuadEdgeSubdivision
151/258 Test #151: unit-triangulate-quadedge-QuadEdgeSubdivision ............   Passed    0.09 sec
        Start 152: unit-triangulate-quadedge-QuadEdge
152/258 Test #152: unit-triangulate-quadedge-QuadEdge .......................   Passed    0.09 sec
        Start 153: unit-triangulate-quadedge-Vertex
153/258 Test #153: unit-triangulate-quadedge-Vertex .........................   Passed    0.09 sec
        Start 154: unit-util-UniqueCoordinateArrayFilter
154/258 Test #154: unit-util-UniqueCoordinateArrayFilter ....................   Passed    0.09 sec
        Start 155: general-TestBoundary
155/258 Test #155: general-TestBoundary .....................................   Passed    0.02 sec
        Start 156: general-TestBuffer
156/258 Test #156: general-TestBuffer .......................................   Passed    0.10 sec
        Start 157: general-TestBufferMitredJoin
157/258 Test #157: general-TestBufferMitredJoin .............................   Passed    0.02 sec
        Start 158: general-TestCentroid
158/258 Test #158: general-TestCentroid .....................................***Failed    0.02 sec
        Start 159: general-TestConvexHull-big
159/258 Test #159: general-TestConvexHull-big ...............................   Passed    0.02 sec
        Start 160: general-TestConvexHull
160/258 Test #160: general-TestConvexHull ...................................   Passed    0.02 sec
        Start 161: general-TestDensify
161/258 Test #161: general-TestDensify ......................................   Passed    0.02 sec
        Start 162: general-TestDistance
162/258 Test #162: general-TestDistance .....................................   Passed    0.02 sec
        Start 163: general-TestEqualsExact
163/258 Test #163: general-TestEqualsExact ..................................   Passed    0.02 sec
        Start 164: general-TestFunctionAA
164/258 Test #164: general-TestFunctionAA ...................................   Passed    0.08 sec
        Start 165: general-TestFunctionAAPrec
165/258 Test #165: general-TestFunctionAAPrec ...............................   Passed    0.08 sec
        Start 166: general-TestFunctionLA
166/258 Test #166: general-TestFunctionLA ...................................   Passed    0.07 sec
        Start 167: general-TestFunctionLAPrec
167/258 Test #167: general-TestFunctionLAPrec ...............................   Passed    0.02 sec
        Start 168: general-TestFunctionLL
168/258 Test #168: general-TestFunctionLL ...................................   Passed    0.04 sec
        Start 169: general-TestFunctionLLPrec
169/258 Test #169: general-TestFunctionLLPrec ...............................   Passed    0.02 sec
        Start 170: general-TestFunctionPA
170/258 Test #170: general-TestFunctionPA ...................................   Passed    0.03 sec
        Start 171: general-TestFunctionPL
171/258 Test #171: general-TestFunctionPL ...................................   Passed    0.03 sec
        Start 172: general-TestFunctionPLPrec
172/258 Test #172: general-TestFunctionPLPrec ...............................   Passed    0.02 sec
        Start 173: general-TestFunctionPP
173/258 Test #173: general-TestFunctionPP ...................................   Passed    0.02 sec
        Start 174: general-TestInteriorPoint
174/258 Test #174: general-TestInteriorPoint ................................***Failed    0.02 sec
        Start 175: general-TestIntersectsPL
175/258 Test #175: general-TestIntersectsPL .................................   Passed    0.02 sec
        Start 176: general-TestMinimumClearance
176/258 Test #176: general-TestMinimumClearance .............................   Passed    0.02 sec
        Start 177: general-TestPreparedIntersectsPL
177/258 Test #177: general-TestPreparedIntersectsPL .........................   Passed    0.02 sec
        Start 178: general-TestPreparedPointPredicate
178/258 Test #178: general-TestPreparedPointPredicate .......................   Passed    0.02 sec
        Start 179: general-TestPreparedPolygonPredicate
179/258 Test #179: general-TestPreparedPolygonPredicate .....................   Passed    0.02 sec
        Start 180: general-TestPreparedPredicatesWithGeometryCollection
180/258 Test #180: general-TestPreparedPredicatesWithGeometryCollection .....   Passed    0.02 sec
        Start 181: general-TestRectanglePredicate
181/258 Test #181: general-TestRectanglePredicate ...........................   Passed    0.02 sec
        Start 182: general-TestRelateAA
182/258 Test #182: general-TestRelateAA .....................................   Passed    0.02 sec
        Start 183: general-TestRelateAC
183/258 Test #183: general-TestRelateAC .....................................   Passed    0.02 sec
        Start 184: general-TestRelateLA
184/258 Test #184: general-TestRelateLA .....................................   Passed    0.02 sec
        Start 185: general-TestRelateLC
185/258 Test #185: general-TestRelateLC .....................................   Passed    0.02 sec
        Start 186: general-TestRelateLL
186/258 Test #186: general-TestRelateLL .....................................   Passed    0.02 sec
        Start 187: general-TestRelatePA
187/258 Test #187: general-TestRelatePA .....................................   Passed    0.02 sec
        Start 188: general-TestRelatePL
188/258 Test #188: general-TestRelatePL .....................................   Passed    0.02 sec
        Start 189: general-TestRelatePP
189/258 Test #189: general-TestRelatePP .....................................   Passed    0.02 sec
        Start 190: general-TestSimple
190/258 Test #190: general-TestSimple .......................................   Passed    0.02 sec
        Start 191: general-TestUnaryUnion
191/258 Test #191: general-TestUnaryUnion ...................................   Passed    0.03 sec
        Start 192: general-TestUnaryUnionFloating
192/258 Test #192: general-TestUnaryUnionFloating ...........................   Passed    0.02 sec
        Start 193: general-TestValid
193/258 Test #193: general-TestValid ........................................   Passed    0.03 sec
        Start 194: general-TestValid2-big
194/258 Test #194: general-TestValid2-big ...................................   Passed    0.02 sec
        Start 195: general-TestValid2
195/258 Test #195: general-TestValid2 .......................................   Passed    0.09 sec
        Start 196: general-TestWithinDistance
196/258 Test #196: general-TestWithinDistance ...............................   Passed    0.02 sec
        Start 197: issue-issue-geos-176
197/258 Test #197: issue-issue-geos-176 .....................................   Passed    0.02 sec
        Start 198: issue-issue-geos-188
198/258 Test #198: issue-issue-geos-188 .....................................   Passed    0.02 sec
        Start 199: issue-issue-geos-234
199/258 Test #199: issue-issue-geos-234 .....................................   Passed    0.02 sec
        Start 200: issue-issue-geos-244
200/258 Test #200: issue-issue-geos-244 .....................................   Passed    5.29 sec
        Start 201: issue-issue-geos-275
201/258 Test #201: issue-issue-geos-275 .....................................   Passed    0.07 sec
        Start 202: issue-issue-geos-350
202/258 Test #202: issue-issue-geos-350 .....................................***Failed    0.02 sec
        Start 203: issue-issue-geos-356
203/258 Test #203: issue-issue-geos-356 .....................................   Passed    0.02 sec
        Start 204: issue-issue-geos-358
204/258 Test #204: issue-issue-geos-358 .....................................***Failed    0.15 sec
        Start 205: issue-issue-geos-360
205/258 Test #205: issue-issue-geos-360 .....................................   Passed    0.02 sec
        Start 206: issue-issue-geos-366
206/258 Test #206: issue-issue-geos-366 .....................................   Passed    0.04 sec
        Start 207: issue-issue-geos-392
207/258 Test #207: issue-issue-geos-392 .....................................   Passed    0.13 sec
        Start 208: issue-issue-geos-398
208/258 Test #208: issue-issue-geos-398 .....................................   Passed    0.02 sec
        Start 209: issue-issue-geos-434
209/258 Test #209: issue-issue-geos-434 .....................................   Passed    0.04 sec
        Start 210: issue-issue-geos-459
210/258 Test #210: issue-issue-geos-459 .....................................   Passed    0.02 sec
        Start 211: issue-issue-geos-488
211/258 Test #211: issue-issue-geos-488 .....................................***Failed    0.03 sec
        Start 212: issue-issue-geos-527
212/258 Test #212: issue-issue-geos-527 .....................................   Passed    0.02 sec
        Start 213: issue-issue-geos-569
213/258 Test #213: issue-issue-geos-569 .....................................   Passed    0.03 sec
        Start 214: issue-issue-geos-582
214/258 Test #214: issue-issue-geos-582 .....................................   Passed    0.02 sec
        Start 215: issue-issue-geos-586
215/258 Test #215: issue-issue-geos-586 .....................................   Passed    0.08 sec
        Start 216: issue-issue-geos-599
216/258 Test #216: issue-issue-geos-599 .....................................***Failed    0.02 sec
        Start 217: issue-issue-geos-605
217/258 Test #217: issue-issue-geos-605 .....................................   Passed    0.04 sec
        Start 218: issue-issue-geos-615
218/258 Test #218: issue-issue-geos-615 .....................................   Passed    0.03 sec
        Start 219: issue-issue-geos-716
219/258 Test #219: issue-issue-geos-716 .....................................   Passed    0.02 sec
        Start 220: issue-issue-geos-837
220/258 Test #220: issue-issue-geos-837 .....................................***Failed    0.86 sec
        Start 221: issue-issue-geos-838
221/258 Test #221: issue-issue-geos-838 .....................................   Passed    0.02 sec
        Start 222: issue-issue-geos-990
222/258 Test #222: issue-issue-geos-990 .....................................   Passed    0.02 sec
        Start 223: issue-issue-geos-994
223/258 Test #223: issue-issue-geos-994 .....................................   Passed    0.05 sec
        Start 224: misc-Buffer-1
224/258 Test #224: misc-Buffer-1 ............................................   Passed    0.36 sec
        Start 225: misc-Buffer-2
225/258 Test #225: misc-Buffer-2 ............................................   Passed    0.02 sec
        Start 226: misc-InvalidRelates
226/258 Test #226: misc-InvalidRelates ......................................   Passed    0.02 sec
        Start 227: misc-Segfaults
227/258 Test #227: misc-Segfaults ...........................................   Passed    0.02 sec
        Start 228: misc-TestBufferExternal-1
228/258 Test #228: misc-TestBufferExternal-1 ................................   Passed    0.02 sec
        Start 229: misc-TestBufferExternal-2
229/258 Test #229: misc-TestBufferExternal-2 ................................   Passed    1.74 sec
        Start 230: misc-TestIsValid
230/258 Test #230: misc-TestIsValid .........................................   Passed    0.02 sec
        Start 231: misc-buildarea
231/258 Test #231: misc-buildarea ...........................................   Passed    0.03 sec
        Start 232: misc-fme
232/258 Test #232: misc-fme .................................................   Passed    2.66 sec
        Start 233: misc-heisenbugs
233/258 Test #233: misc-heisenbugs ..........................................   Passed    0.03 sec
        Start 234: misc-hexwkb
234/258 Test #234: misc-hexwkb ..............................................   Passed    0.02 sec
        Start 235: misc-hole_from_shell
235/258 Test #235: misc-hole_from_shell .....................................   Passed    0.03 sec
        Start 236: misc-hole_red
236/258 Test #236: misc-hole_red ............................................   Passed    0.02 sec
        Start 237: misc-linemerge
237/258 Test #237: misc-linemerge ...........................................   Passed    0.02 sec
        Start 238: misc-makevalid
238/258 Test #238: misc-makevalid ...........................................   Passed    0.04 sec
        Start 239: misc-robustness
239/258 Test #239: misc-robustness ..........................................   Passed    0.09 sec
        Start 240: misc-safe-16595
240/258 Test #240: misc-safe-16595 ..........................................   Passed    0.61 sec
        Start 241: misc-safe-16596
241/258 Test #241: misc-safe-16596 ..........................................   Passed    0.19 sec
        Start 242: misc-safe-TestBufferJagged
242/258 Test #242: misc-safe-TestBufferJagged ...............................   Passed    5.52 sec
        Start 243: misc-singlesidedbuffer
243/258 Test #243: misc-singlesidedbuffer ...................................   Passed    0.02 sec
        Start 244: misc-split
244/258 Test #244: misc-split ...............................................   Passed    0.02 sec
        Start 245: misc-stmlf-20061020-invalid-output
245/258 Test #245: misc-stmlf-20061020-invalid-output .......................   Passed    0.09 sec
        Start 246: misc-stmlf-20061020
246/258 Test #246: misc-stmlf-20061020 ......................................   Passed    0.23 sec
        Start 247: misc-stmlf-20070119
247/258 Test #247: misc-stmlf-20070119 ......................................   Passed    0.02 sec
        Start 248: robust-TestRobustOverlayFixed
248/258 Test #248: robust-TestRobustOverlayFixed ............................   Passed    0.02 sec
        Start 249: robust-TestRobustRelate
249/258 Test #249: robust-TestRobustRelate ..................................   Passed    0.02 sec
        Start 250: validate-TestRelateAA-big
250/258 Test #250: validate-TestRelateAA-big ................................   Passed    0.02 sec
        Start 251: validate-TestRelateAA
251/258 Test #251: validate-TestRelateAA ....................................   Passed    0.15 sec
        Start 252: validate-TestRelateAC
252/258 Test #252: validate-TestRelateAC ....................................   Passed    0.02 sec
        Start 253: validate-TestRelateLA
253/258 Test #253: validate-TestRelateLA ....................................   Passed    0.09 sec
        Start 254: validate-TestRelateLC
254/258 Test #254: validate-TestRelateLC ....................................   Passed    0.02 sec
        Start 255: validate-TestRelateLL
255/258 Test #255: validate-TestRelateLL ....................................   Passed    0.16 sec
        Start 256: validate-TestRelatePA
256/258 Test #256: validate-TestRelatePA ....................................   Passed    0.04 sec
        Start 257: validate-TestRelatePL
257/258 Test #257: validate-TestRelatePL ....................................   Passed    0.09 sec
        Start 258: validate-TestRelatePP
258/258 Test #258: validate-TestRelatePP ....................................   Passed    0.02 sec

96% tests passed, 10 tests failed out of 258

Total Test time (real) =  36.10 sec

The following tests FAILED:
	 16 - unit-algorithm-RobustLineIntersection (Failed)
	 84 - unit-geom-Geometry-touches (Failed)
	112 - unit-linearref-LengthIndexedLine (Failed)
	158 - general-TestCentroid (Failed)
	174 - general-TestInteriorPoint (Failed)
	202 - issue-issue-geos-350 (Failed)
	204 - issue-issue-geos-358 (Failed)
	211 - issue-issue-geos-488 (Failed)
	216 - issue-issue-geos-599 (Failed)
	220 - issue-issue-geos-837 (Failed)
Errors while running CTest
make[4]: *** [Makefile:96: test] Error 8
make[3]: *** [CMakeFiles/check.dir/build.make:57: CMakeFiles/check] Error 2
make[2]: *** [CMakeFiles/Makefile2:1139: CMakeFiles/check.dir/all] Error 2
make[1]: *** [CMakeFiles/Makefile2:1146: CMakeFiles/check.dir/rule] Error 2
make: *** [Makefile:626: check] Error 2

Change History (3)

comment:1 Changed 5 weeks ago by robe

Description: modified (diff)

comment:2 Changed 5 weeks ago by robe

Description: modified (diff)

comment:3 Changed 5 weeks ago by pramsey

Milestone: 3.8.03.8.1
Note: See TracTickets for help on using tickets.